{"text_format":"1","workbook":"xlsx","n_sheets":8,"sheets":["COC","Informe","Gravimetría","Espectrofotometría","Titulación","Cromatografía gases","Cromatografía iónica","Descripcion"],"not_rendered":{"charts":0,"images":3,"macros":1,"external_links":0,"defined_names":184,"comments":2,"pivot_tables":0},"unopened":[],"bounds":{"document_bytes":16777216,"sheet_cells":100000,"rows_first":2000,"rows_last":500,"rows_between":2000,"halvings":0,"cell_chars":16384,"cell_head_chars":4096},"cells_cut":0,"cells_raw":0,"read":"whole","date_system":"1900"}

{"sheet":"COC","index":0,"n_rows":63,"n_cols":11,"rows_kept":63,"cut":false,"hidden":false,"merged":[[2,0,2,2],[2,3,2,5],[3,1,3,2],[3,4,3,5],[4,1,4,2],[4,4,4,5],[12,1,12,5],[5,1,5,2],[5,4,5,5],[6,1,6,2],[6,4,6,5],[7,1,7,2],[7,4,7,5],[8,1,8,2],[8,3,9,3],[8,4,9,5],[9,1,9,2],[11,0,11,5],[62,0,62,5],[57,0,57,5],[45,1,45,5],[46,1,46,2],[46,4,46,5],[48,1,48,5],[50,0,50,5],[52,0,52,5],[53,0,53,5],[54,0,54,5],[56,0,56,5],[40,1,40,5],[41,1,41,2],[41,4,41,5],[42,1,42,2],[42,4,42,5],[13,1,13,2],[14,0,15,0],[14,1,15,5],[17,0,17,5],[39,0,39,5],[13,3,13,5],[58,0,58,5],[59,0,59,5],[60,0,60,5],[61,0,61,5],[44,0,44,5]]}
["Movimiento",null,"Custodia ",null,"Informe"]
[]
["Reportar a:",null,null,"Facturar a:"]
["*Responsable",null,null,"*Razón social"]
["Empresa/Organización",null,null,"*Correo de facturación"]
["Ciudad / País",null,null,"Ciudad / País"]
["Dirección",null,null,"Teléfono"]
["Teléfono",null,null,"Orden de servicio"]
["*Propuesta / OC",null,null,"Observaciones"]
["*Correo electrónico"]
[]
["Información del proyecto "]
["*Nombre del proyecto",null,null,null,null,null,null,null,"Opcion"]
["*Cantidad de muestras",null,null,null,null,null,null,null,null,2,false]
["Instrucciones especiales",null,null,null,null,null,null,null,{"$f":"+OFFSET(Medios,MATCH($E36,Análisis2,0)-1,0,COUNTIF(Análisis2,$E36),1)","v":{"$error":"#N/A"}},null,false]
[]
[]
["Información de las muestras"]
["*ID Laboratorio","*ID Cliente","*Fecha de muestreo","*Método","*Análisis","*Medio de retención"]
[]
[]
[]
[]
[]
[]
[]
[]
[]
[]
[]
[]
[]
[]
[]
[]
[]
[]
[]
[]
["Entregado por"]
["*Responsable"]
["*Fecha",null,null,"*Hora"]
["Método de envío",null,null,"Numero de guía"]
[]
["Recibido por"]
["Responsable"]
["Fecha",null,null,"Hora"]
["Temperatura (°C)",null,null,"Condiciones embalaje "]
["Observaciones generales"]
[]
["Nota: Muestras recibidas posterior a las 12:00 PM serán consideradas recepcionadas el siguiente día hábil."]
[]
["Convenciones: "]
["*Campos obligatorios"]
["Fecha: Fecha de muestreo (DD/MM/YYYY)"]
[]
["Consideraciones especiales:"]
["- El laboratorio no fue responsable del envío de las muestras ni de la integralidad de estas antes de ingresar a las instalaciones."]
[" - A menos de que sea notificado y este descrito en las observaciones, las muestras fueron recepcionadas en condiciones aceptables."]
["-  El laboratorio no fue responsable de la etapa de muestreo y sus datos."]
["-  Toda novedad en la recepción podrá provocar rechazos o retrasos en la entrega de resultados."]
["-  Los métodos de calidad del aire como PM2.5, PM10, PST y dióxido de azufre hacen parte del US-CFR Título 40, Capítulo I, Subcapítulo C, Parte 50. Se describirá para cada compuesto el apéndice específico."]
["-   Los métodos de fuentes fijas como material particulado, dióxido de azufre, dióxido de nitrógeno, haluros de hidrogeno, ácido sulfúrico – trióxido de azufre y COV’s hacen parte del US-CFR Título 40, Capítulo I, Subcapítulo C, Parte 60. Se describirá para cada compuesto el apéndice y número de método específico."]

{"sheet":"Informe","index":1,"n_rows":33,"n_cols":11,"rows_kept":33,"cut":false,"hidden":true,"merged":[[0,0,2,6],[13,8,16,12],[13,7,16,7]]}
["Formato de analisis ambiental"]
[]
[]
[]
[null,"Proyecto: ",{"$f":"IF($K$13=0,\"\",COC!B13)","v":""}]
[null,"Empresa:",{"$f":"IF($K$13=0,\"\",COC!B5)","v":""}]
[null,"Solicitante: ",{"$f":"IF($K$13=0,\"\",COC!B4)","v":""}]
[null,"E-mail: ",{"$f":"IF($K$13=0,\"\",COC!B10)","v":""}]
[null,"Dirección: ",{"$f":"IF($K$13=0,\"\",COC!B7)","v":""}]
[null,"Teléfono:",{"$f":"IF($K$13=0,\"\",COC!B8)","v":""}]
[]
[]
["Numero de muestra","*ID ","Consecutivo Custodia","*Fecha de muestreo","*Método","*Análisis","*Medio de retención","Fecha de recepcion",{"$f":"IF(K13=0,\"\",COC!B47)","v":""},"Custodia ",{"$f":"COC!D1","v":0}]
[null,{"$f":"CONCATENATE(COC!A20,\"-\",COC!B20)","v":"-"},{"$f":"IF(A14=0,\"\",_xlfn.CONCAT($K$13,\"-\",A14))","v":""},{"$f":"IF(A14=0,\"\",COC!C20)","v":""},{"$f":"IF(A14=0,\"\",COC!D20)","v":""},{"$f":"IF(A14=0,\"\",COC!E20)","v":""},{"$f":"IF(A14=0,\"\",COC!F20)","v":""},"Observaciones",{"$f":"IF(AND(COC!B49=0,COC!B15=0),\"Sin observaciones\",_xlfn.CONCAT(COC!B15,\"-\",COC!B49))","v":"Sin observaciones"}]
[null,{"$f":"CONCATENATE(COC!A21,\"-\",COC!B21)","v":"-"},{"$f":"IF(A15=0,\"\",_xlfn.CONCAT($K$13,\"-\",A15))","v":""},{"$f":"IF(A15=0,\"\",COC!C21)","v":""},{"$f":"IF(A15=0,\"\",COC!D21)","v":""},{"$f":"IF(A15=0,\"\",COC!E21)","v":""},{"$f":"IF(A15=0,\"\",COC!F21)","v":""}]
[null,{"$f":"CONCATENATE(COC!A22,\"-\",COC!B22)","v":"-"},"",{"$f":"IF(A16=0,\"\",COC!C22)","v":""},{"$f":"IF(A16=0,\"\",COC!D22)","v":""},{"$f":"IF(A16=0,\"\",COC!E22)","v":""},{"$f":"IF(A16=0,\"\",COC!F22)","v":""}]
[null,{"$f":"CONCATENATE(COC!A23,\"-\",COC!B23)","v":"-"},"",{"$f":"IF(A17=0,\"\",COC!C23)","v":""},{"$f":"IF(A17=0,\"\",COC!D23)","v":""},{"$f":"IF(A17=0,\"\",COC!E23)","v":""},{"$f":"IF(A17=0,\"\",COC!F23)","v":""}]
[null,{"$f":"CONCATENATE(COC!A24,\"-\",COC!B24)","v":"-"},"",{"$f":"IF(A18=0,\"\",COC!C24)","v":""},{"$f":"IF(A18=0,\"\",COC!D24)","v":""},{"$f":"IF(A18=0,\"\",COC!E24)","v":""},{"$f":"IF(A18=0,\"\",COC!F24)","v":""}]
[null,{"$f":"CONCATENATE(COC!A25,\"-\",COC!B25)","v":"-"},"",{"$f":"IF(A19=0,\"\",COC!C25)","v":""},{"$f":"IF(A19=0,\"\",COC!D25)","v":""},{"$f":"IF(A19=0,\"\",COC!E25)","v":""},{"$f":"IF(A19=0,\"\",COC!F25)","v":""}]
[null,{"$f":"CONCATENATE(COC!A26,\"-\",COC!B26)","v":"-"},"",{"$f":"IF(A20=0,\"\",COC!C26)","v":""},{"$f":"IF(A20=0,\"\",COC!D26)","v":""},{"$f":"IF(A20=0,\"\",COC!E26)","v":""},{"$f":"IF(A20=0,\"\",COC!F26)","v":""}]
[null,{"$f":"CONCATENATE(COC!A27,\"-\",COC!B27)","v":"-"},"",{"$f":"IF(A21=0,\"\",COC!C27)","v":""},{"$f":"IF(A21=0,\"\",COC!D27)","v":""},{"$f":"IF(A21=0,\"\",COC!E27)","v":""},{"$f":"IF(A21=0,\"\",COC!F27)","v":""}]
[null,{"$f":"CONCATENATE(COC!A28,\"-\",COC!B28)","v":"-"},"",{"$f":"IF(A22=0,\"\",COC!C28)","v":""},{"$f":"IF(A22=0,\"\",COC!D28)","v":""},{"$f":"IF(A22=0,\"\",COC!E28)","v":""},{"$f":"IF(A22=0,\"\",COC!F28)","v":""}]
[null,{"$f":"CONCATENATE(COC!A29,\"-\",COC!B29)","v":"-"},"",{"$f":"IF(A23=0,\"\",COC!C29)","v":""},{"$f":"IF(A23=0,\"\",COC!D29)","v":""},{"$f":"IF(A23=0,\"\",COC!E29)","v":""},{"$f":"IF(A23=0,\"\",COC!F29)","v":""}]
[null,{"$f":"CONCATENATE(COC!A30,\"-\",COC!B30)","v":"-"},"",{"$f":"IF(A24=0,\"\",COC!C30)","v":""},{"$f":"IF(A24=0,\"\",COC!D30)","v":""},{"$f":"IF(A24=0,\"\",COC!E30)","v":""},{"$f":"IF(A24=0,\"\",COC!F30)","v":""}]
[null,{"$f":"CONCATENATE(COC!A31,\"-\",COC!B31)","v":"-"},"",{"$f":"IF(A25=0,\"\",COC!C31)","v":""},{"$f":"IF(A25=0,\"\",COC!D31)","v":""},{"$f":"IF(A25=0,\"\",COC!E31)","v":""},{"$f":"IF(A25=0,\"\",COC!F31)","v":""}]
[null,{"$f":"CONCATENATE(COC!A32,\"-\",COC!B32)","v":"-"},"",{"$f":"IF(A26=0,\"\",COC!C32)","v":""},{"$f":"IF(A26=0,\"\",COC!D32)","v":""},{"$f":"IF(A26=0,\"\",COC!E32)","v":""},{"$f":"IF(A26=0,\"\",COC!F32)","v":""}]
[null,{"$f":"CONCATENATE(COC!A33,\"-\",COC!B33)","v":"-"},"",{"$f":"IF(A27=0,\"\",COC!C33)","v":""},{"$f":"IF(A27=0,\"\",COC!D33)","v":""},{"$f":"IF(A27=0,\"\",COC!E33)","v":""},{"$f":"IF(A27=0,\"\",COC!F33)","v":""}]
[null,{"$f":"CONCATENATE(COC!A34,\"-\",COC!B34)","v":"-"},"",{"$f":"IF(A28=0,\"\",COC!C34)","v":""},{"$f":"IF(A28=0,\"\",COC!D34)","v":""},{"$f":"IF(A28=0,\"\",COC!E34)","v":""},{"$f":"IF(A28=0,\"\",COC!F34)","v":""}]
[null,{"$f":"CONCATENATE(COC!A35,\"-\",COC!B35)","v":"-"},"",{"$f":"IF(A29=0,\"\",COC!C35)","v":""},{"$f":"IF(A29=0,\"\",COC!D35)","v":""},{"$f":"IF(A29=0,\"\",COC!E35)","v":""},{"$f":"IF(A29=0,\"\",COC!F35)","v":""}]
[null,{"$f":"CONCATENATE(COC!A36,\"-\",COC!B36)","v":"-"},"",{"$f":"IF(A30=0,\"\",COC!C36)","v":""},{"$f":"IF(A30=0,\"\",COC!D36)","v":""},{"$f":"IF(A30=0,\"\",COC!E36)","v":""},{"$f":"IF(A30=0,\"\",COC!F36)","v":""}]
[null,{"$f":"CONCATENATE(COC!A37,\"-\",COC!B37)","v":"-"},"",{"$f":"IF(A31=0,\"\",COC!C37)","v":""},{"$f":"IF(A31=0,\"\",COC!D37)","v":""},{"$f":"IF(A31=0,\"\",COC!E37)","v":""},{"$f":"IF(A31=0,\"\",COC!F37)","v":""}]
[null,{"$f":"CONCATENATE(COC!A38,\"-\",COC!B38)","v":"-"},"",{"$f":"IF(A32=0,\"\",COC!C38)","v":""},{"$f":"IF(A32=0,\"\",COC!D38)","v":""},{"$f":"IF(A32=0,\"\",COC!E38)","v":""},{"$f":"IF(A32=0,\"\",COC!F38)","v":""}]
[null,{"$f":"CONCATENATE(COC!A39,\"-\",COC!B39)","v":"-"},"",{"$f":"IF(A33=0,\"\",COC!C39)","v":""},{"$f":"IF(A33=0,\"\",COC!D39)","v":""},{"$f":"IF(A33=0,\"\",COC!E39)","v":""},{"$f":"IF(A33=0,\"\",COC!F39)","v":""}]

{"sheet":"Gravimetría","index":2,"n_rows":67,"n_cols":14,"rows_kept":67,"cut":false,"hidden":true,"merged":[[14,1,15,1],[14,5,15,5],[48,1,55,1],[48,2,55,8],[18,8,37,8],[47,6,47,8],[47,2,47,4],[45,4,45,6],[8,4,9,4],[10,4,11,4],[58,2,58,4],[58,6,58,8],[57,2,57,4],[57,6,57,8],[46,2,46,4],[46,6,46,8],[8,8,9,8],[10,8,11,8],[12,8,13,8],[8,6,9,6],[10,6,11,6],[12,6,13,6],[12,4,13,4],[14,4,15,4],[0,0,2,8],[59,1,65,1],[59,2,65,8],[6,2,6,8],[7,1,7,8],[8,1,9,1],[8,3,13,3],[8,5,13,5],[8,7,13,7],[11,1,13,1],[39,1,43,1],[3,1,3,8],[4,2,4,3],[4,4,4,5],[5,2,5,3],[5,4,5,5]]}
["Formato de analisis ambiental"]
[]
[]
[null,"Recepción de muestra"]
[null,"Movimiento",{"$f":"IF(COC!B1=0,\"\",COC!B1)","v":""},null,"Custodia",null,{"$f":"IF(COC!B1=0,\"\",COC!D1)","v":""},"Informe",{"$f":"IF(COC!B1=0,\"\",COC!F1)","v":""}]
[null,"Cantidad",{"$f":"IF(COC!B1=0,\"\",COC!B14)","v":""},null,"Fecha de recepción",null,{"$f":"IF(COC!B1=0,\"\",COC!B47)","v":""},"Hora ",{"$f":"IF(COC!$D$1=0,\"\",COC!E47)","v":""}]
[null,"Observaciones",{"$f":"IF(AND(COC!B49=0,COC!B15=0),\"Sin observaciones\",_xlfn.CONCAT(COC!B15,\"-\",COC!B49))","v":"Sin observaciones"}]
[null,"Análisis de muestras",null,null,"Analisis de las muestras"]
[null,"Balanza ID",null,"Verificación",null,"Fecha",null,"Realizó"]
[]
[null,"Masas  ID"]
[null,"Masas (mg)"]
[]
[]
[null,"Controles","Descarga de datos condiciones ",false,"Informe Acetona ",null,"Carta control (PM2.5)",null,"Códigos verificados (10%)"]
[null,null,"Revisión de datos condiciones ",false,null,null,"Revisón Carta Control (PM2.5)"]
[]
["#","ID Laboratorio","Análisis","Método","Medio ","ID Beaker","Masa","Unidad","Fecha","Bk",null,null,null,"unidades"]
[1,{"$f":"IF(COC!A20=0,\"\",COC!A20)","v":""},{"$f":"IF(COC!A20=0,\"\",COC!E20)","v":""},{"$f":"IF(COC!A20=0,\"\",COC!D20)","v":""},{"$f":"IF(COC!A20=0,\"\",COC!F20)","v":""},null,null,{"$f":"+IF(COC!A20=0,\"\",IF(OR(C19=\"PM2.5\",E19=\"F. PTFE 46.2 mm\"),\"µg\",$N$20))","v":""},null,false,null,1,null,"µg"]
[2,{"$f":"IF(COC!A21=0,\"\",COC!A21)","v":""},{"$f":"IF(COC!A21=0,\"\",COC!E21)","v":""},{"$f":"IF(COC!A21=0,\"\",COC!D21)","v":""},{"$f":"IF(COC!A21=0,\"\",COC!F21)","v":""},null,null,{"$f":"+IF(COC!A21=0,\"\",IF(OR(C20=\"PM2.5\",E20=\"F. PTFE 46.2 mm\"),\"µg\",$N$20))","v":""},null,false,null,2,null,"mg"]
[3,{"$f":"IF(COC!A22=0,\"\",COC!A22)","v":""},{"$f":"IF(COC!A22=0,\"\",COC!E22)","v":""},{"$f":"IF(COC!A22=0,\"\",COC!D22)","v":""},{"$f":"IF(COC!A22=0,\"\",COC!F22)","v":""},null,null,{"$f":"+IF(COC!A22=0,\"\",IF(OR(C21=\"PM2.5\",E21=\"F. PTFE 46.2 mm\"),\"µg\",$N$20))","v":""},null,false,null,3,null,"g"]
[4,{"$f":"IF(COC!A23=0,\"\",COC!A23)","v":""},{"$f":"IF(COC!A23=0,\"\",COC!E23)","v":""},{"$f":"IF(COC!A23=0,\"\",COC!D23)","v":""},{"$f":"IF(COC!A23=0,\"\",COC!F23)","v":""},null,null,{"$f":"+IF(COC!A23=0,\"\",IF(OR(C22=\"PM2.5\",E22=\"F. PTFE 46.2 mm\"),\"µg\",$N$20))","v":""},null,false,null,4,null,"kg"]
[5,{"$f":"IF(COC!A24=0,\"\",COC!A24)","v":""},{"$f":"IF(COC!A24=0,\"\",COC!E24)","v":""},{"$f":"IF(COC!A24=0,\"\",COC!D24)","v":""},{"$f":"IF(COC!A24=0,\"\",COC!F24)","v":""},null,null,{"$f":"+IF(COC!A24=0,\"\",IF(OR(C23=\"PM2.5\",E23=\"F. PTFE 46.2 mm\"),\"µg\",$N$20))","v":""},null,false,null,5]
[6,{"$f":"IF(COC!A25=0,\"\",COC!A25)","v":""},{"$f":"IF(COC!A25=0,\"\",COC!E25)","v":""},{"$f":"IF(COC!A25=0,\"\",COC!D25)","v":""},{"$f":"IF(COC!A25=0,\"\",COC!F25)","v":""},null,null,{"$f":"+IF(COC!A25=0,\"\",IF(OR(C24=\"PM2.5\",E24=\"F. PTFE 46.2 mm\"),\"µg\",$N$20))","v":""},null,false,null,6]
[7,{"$f":"IF(COC!A26=0,\"\",COC!A26)","v":""},{"$f":"IF(COC!A26=0,\"\",COC!E26)","v":""},{"$f":"IF(COC!A26=0,\"\",COC!D26)","v":""},{"$f":"IF(COC!A26=0,\"\",COC!F26)","v":""},null,null,{"$f":"+IF(COC!A26=0,\"\",IF(OR(C25=\"PM2.5\",E25=\"F. PTFE 46.2 mm\"),\"µg\",$N$20))","v":""},null,false,null,7]
[8,{"$f":"IF(COC!A27=0,\"\",COC!A27)","v":""},{"$f":"IF(COC!A27=0,\"\",COC!E27)","v":""},{"$f":"IF(COC!A27=0,\"\",COC!D27)","v":""},{"$f":"IF(COC!A27=0,\"\",COC!F27)","v":""},null,null,{"$f":"+IF(COC!A27=0,\"\",IF(OR(C26=\"PM2.5\",E26=\"F. PTFE 46.2 mm\"),\"µg\",$N$20))","v":""},null,false,null,8]
[9,{"$f":"IF(COC!A28=0,\"\",COC!A28)","v":""},{"$f":"IF(COC!A28=0,\"\",COC!E28)","v":""},{"$f":"IF(COC!A28=0,\"\",COC!D28)","v":""},{"$f":"IF(COC!A28=0,\"\",COC!F28)","v":""},null,null,{"$f":"+IF(COC!A28=0,\"\",IF(OR(C27=\"PM2.5\",E27=\"F. PTFE 46.2 mm\"),\"µg\",$N$20))","v":""},null,false,null,9]
[10,{"$f":"IF(COC!A29=0,\"\",COC!A29)","v":""},{"$f":"IF(COC!A29=0,\"\",COC!E29)","v":""},{"$f":"IF(COC!A29=0,\"\",COC!D29)","v":""},{"$f":"IF(COC!A29=0,\"\",COC!F29)","v":""},null,null,{"$f":"+IF(COC!A29=0,\"\",IF(OR(C28=\"PM2.5\",E28=\"F. PTFE 46.2 mm\"),\"µg\",$N$20))","v":""},null,false,null,10]
[11,{"$f":"IF(COC!A30=0,\"\",COC!A30)","v":""},{"$f":"IF(COC!A30=0,\"\",COC!E30)","v":""},{"$f":"IF(COC!A30=0,\"\",COC!D30)","v":""},{"$f":"IF(COC!A30=0,\"\",COC!F30)","v":""},null,null,{"$f":"+IF(COC!A30=0,\"\",IF(OR(C29=\"PM2.5\",E29=\"F. PTFE 46.2 mm\"),\"µg\",$N$20))","v":""},null,false,null,11]
[12,{"$f":"IF(COC!A31=0,\"\",COC!A31)","v":""},{"$f":"IF(COC!A31=0,\"\",COC!E31)","v":""},{"$f":"IF(COC!A31=0,\"\",COC!D31)","v":""},{"$f":"IF(COC!A31=0,\"\",COC!F31)","v":""},null,null,{"$f":"+IF(COC!A31=0,\"\",IF(OR(C30=\"PM2.5\",E30=\"F. PTFE 46.2 mm\"),\"µg\",$N$20))","v":""},null,false,null,12]
[13,{"$f":"IF(COC!A32=0,\"\",COC!A32)","v":""},{"$f":"IF(COC!A32=0,\"\",COC!E32)","v":""},{"$f":"IF(COC!A32=0,\"\",COC!D32)","v":""},{"$f":"IF(COC!A32=0,\"\",COC!F32)","v":""},null,null,{"$f":"+IF(COC!A32=0,\"\",IF(OR(C31=\"PM2.5\",E31=\"F. PTFE 46.2 mm\"),\"µg\",$N$20))","v":""},null,false,null,13]
[14,{"$f":"IF(COC!A33=0,\"\",COC!A33)","v":""},{"$f":"IF(COC!A33=0,\"\",COC!E33)","v":""},{"$f":"IF(COC!A33=0,\"\",COC!D33)","v":""},{"$f":"IF(COC!A33=0,\"\",COC!F33)","v":""},null,null,{"$f":"+IF(COC!A33=0,\"\",IF(OR(C32=\"PM2.5\",E32=\"F. PTFE 46.2 mm\"),\"µg\",$N$20))","v":""},null,false,null,14]
[15,{"$f":"IF(COC!A34=0,\"\",COC!A34)","v":""},{"$f":"IF(COC!A34=0,\"\",COC!E34)","v":""},{"$f":"IF(COC!A34=0,\"\",COC!D34)","v":""},{"$f":"IF(COC!A34=0,\"\",COC!F34)","v":""},null,null,{"$f":"+IF(COC!A34=0,\"\",IF(OR(C33=\"PM2.5\",E33=\"F. PTFE 46.2 mm\"),\"µg\",$N$20))","v":""},null,false,null,15]
[16,{"$f":"IF(COC!A35=0,\"\",COC!A35)","v":""},{"$f":"IF(COC!A35=0,\"\",COC!E35)","v":""},{"$f":"IF(COC!A35=0,\"\",COC!D35)","v":""},{"$f":"IF(COC!A35=0,\"\",COC!F35)","v":""},null,null,{"$f":"+IF(COC!A35=0,\"\",IF(OR(C34=\"PM2.5\",E34=\"F. PTFE 46.2 mm\"),\"µg\",$N$20))","v":""},null,false,null,16]
[17,{"$f":"IF(COC!A36=0,\"\",COC!A36)","v":""},{"$f":"IF(COC!A36=0,\"\",COC!E36)","v":""},{"$f":"IF(COC!A36=0,\"\",COC!D36)","v":""},{"$f":"IF(COC!A36=0,\"\",COC!F36)","v":""},null,null,{"$f":"+IF(COC!A36=0,\"\",IF(OR(C35=\"PM2.5\",E35=\"F. PTFE 46.2 mm\"),\"µg\",$N$20))","v":""},null,false,null,17]
[18,{"$f":"IF(COC!A37=0,\"\",COC!A37)","v":""},{"$f":"IF(COC!A37=0,\"\",COC!E37)","v":""},{"$f":"IF(COC!A37=0,\"\",COC!D37)","v":""},{"$f":"IF(COC!A37=0,\"\",COC!F37)","v":""},null,null,{"$f":"+IF(COC!A37=0,\"\",IF(OR(C36=\"PM2.5\",E36=\"F. PTFE 46.2 mm\"),\"µg\",$N$20))","v":""},null,false,null,18]
[19,{"$f":"IF(COC!A38=0,\"\",COC!A38)","v":""},{"$f":"IF(COC!A38=0,\"\",COC!E38)","v":""},{"$f":"IF(COC!A38=0,\"\",COC!D38)","v":""},{"$f":"IF(COC!A38=0,\"\",COC!F38)","v":""},null,null,{"$f":"+IF(COC!A38=0,\"\",IF(OR(C37=\"PM2.5\",E37=\"F. PTFE 46.2 mm\"),\"µg\",$N$20))","v":""},null,false,null,19]
[20,{"$f":"IF(COC!A39=0,\"\",COC!A39)","v":""},{"$f":"IF(COC!A39=0,\"\",COC!E39)","v":""},{"$f":"IF(COC!A39=0,\"\",COC!D39)","v":""},{"$f":"IF(COC!A39=0,\"\",COC!F39)","v":""},null,null,{"$f":"+IF(COC!A39=0,\"\",IF(OR(C38=\"PM2.5\",E38=\"F. PTFE 46.2 mm\"),\"µg\",$N$20))","v":""},null,false,null,20]
[]
[null,"Observaciones/ Novedades"]
[]
[]
[]
[]
[]
[null,null,null,null,"Informe de resultados"]
[null,"Realizó",null,null,null,"Revisó 1"]
[null,"Fecha",null,null,null,"Fecha"]
[null,"Observaciones"]
[]
[]
[]
[]
[]
[]
[]
[]
[null,"Realizó",null,null,null,"Revisó 2"]
[null,"Fecha",null,null,null,"Fecha"]
[null,"Observaciones"]
[]
[]
[]
[]
[]
[]
[null,null,"Incidencia"]

{"sheet":"Espectrofotometría","index":3,"n_rows":69,"n_cols":14,"rows_kept":69,"cut":false,"hidden":true,"merged":[[16,1,18,1],[17,8,18,8],[60,2,60,4],[60,6,60,8],[49,2,49,4],[49,6,49,8],[50,2,50,4],[50,6,50,8],[59,2,59,4],[59,6,59,8],[5,4,5,5],[8,4,8,7],[6,2,6,8],[9,2,9,3],[10,1,15,1],[10,4,15,4],[0,0,2,9],[61,1,67,1],[61,2,67,8],[51,1,57,1],[51,2,57,8],[58,3,58,4],[58,5,58,6],[58,7,58,8],[48,4,48,6],[8,1,9,1],[8,2,8,3],[42,1,46,1],[3,1,3,8],[4,2,4,3],[4,4,4,5],[5,2,5,3]]}
["Formato de analisis ambiental"]
[]
[]
[null,"Recepción de muestra"]
[null,"Movimiento",{"$f":"IF(COC!B1=0,\"\",COC!B1)","v":""},null,"Custodia",null,{"$f":"IF(COC!B1=0,\"\",COC!D1)","v":""},"Informe",{"$f":"IF(COC!B1=0,\"\",COC!F1)","v":""}]
[null,"Cantidad",{"$f":"IF(COC!B1=0,\"\",COC!B14)","v":""},null,"Fecha de recepción",null,{"$f":"IF(COC!B1=0,\"\",COC!B47)","v":""},"Hora ",{"$f":"IF(COC!$D$1=0,\"\",COC!E47)","v":""}]
[null,"Observaciones",{"$f":"IF(AND(COC!B49=0,COC!B15=0),\"Sin observaciones\",_xlfn.CONCAT(COC!B15,\"-\",COC!B49))","v":"Sin observaciones"}]
[null,"Análisis de muestras",null,null,"Analisis de las muestras"]
[null,"Equipo","Espectrofotómetro ",null,null,null,null,null,"Temperatura °C"]
[null,null,"Almacenamiento",null,null,null,"Refrigeración"]
[null,"Análisis de muestras","Fecha",null,"Responsable ",null,"Hora desarrollo curva "]
[null,null,"Rango de muestras",null,null,null,"Hora desarrollo muestras"]
[null,null,"Fecha",null,null,null,"Hora desarrollo curva "]
[null,null,"Rango de muestras",null,null,null,"Hora desarrollo muestras"]
[null,null,"Fecha",null,null,null,"Hora desarrollo curva "]
[null,null,"Rango de muestras",null,null,null,"Hora desarrollo muestras"]
[null,"Controles","Descarga de datos nevera",null,"Descarga de datos desarrollo de color ",null,"Carta control ",false,"Código duplicado de muestra"]
[null,null,"Revisón de datos nevera",null,"Revisión de datos desarrollo de color ",null,"Revisón Carta Control",false]
[null,null,"Códigos verificados (10%)",null,"Diligenciamiento pureza reactivos",false,"Revisión pureza reactivos",false]
[]
["#","ID Laboratorio","Análisis","Método","Medio ","Volumen","Nivel","pH","Bk",null,null,null,null,"unidades"]
[1,{"$f":"IF(COC!A20=0,\"\",COC!A20)","v":""},{"$f":"IF(COC!A20=0,\"\",COC!E20)","v":""},{"$f":"IF(COC!A20=0,\"\",COC!D20)","v":""},{"$f":"IF(COC!A20=0,\"\",COC!F20)","v":""},null,null,null,false,null,null,1,null,"µg"]
[2,{"$f":"IF(COC!A21=0,\"\",COC!A21)","v":""},{"$f":"IF(COC!A21=0,\"\",COC!E21)","v":""},{"$f":"IF(COC!A21=0,\"\",COC!D21)","v":""},{"$f":"IF(COC!A21=0,\"\",COC!F21)","v":""},null,null,null,false,null,null,2,null,"mg"]
[3,{"$f":"IF(COC!A22=0,\"\",COC!A22)","v":""},{"$f":"IF(COC!A22=0,\"\",COC!E22)","v":""},{"$f":"IF(COC!A22=0,\"\",COC!D22)","v":""},{"$f":"IF(COC!A22=0,\"\",COC!F22)","v":""},null,null,null,false,null,null,3,null,"g"]
[4,{"$f":"IF(COC!A23=0,\"\",COC!A23)","v":""},{"$f":"IF(COC!A23=0,\"\",COC!E23)","v":""},{"$f":"IF(COC!A23=0,\"\",COC!D23)","v":""},{"$f":"IF(COC!A23=0,\"\",COC!F23)","v":""},null,null,null,false,null,null,4,null,"kg"]
[5,{"$f":"IF(COC!A24=0,\"\",COC!A24)","v":""},{"$f":"IF(COC!A24=0,\"\",COC!E24)","v":""},{"$f":"IF(COC!A24=0,\"\",COC!D24)","v":""},{"$f":"IF(COC!A24=0,\"\",COC!F24)","v":""},null,null,null,false,null,null,5]
[6,{"$f":"IF(COC!A25=0,\"\",COC!A25)","v":""},{"$f":"IF(COC!A25=0,\"\",COC!E25)","v":""},{"$f":"IF(COC!A25=0,\"\",COC!D25)","v":""},{"$f":"IF(COC!A25=0,\"\",COC!F25)","v":""},null,null,null,false,null,null,6]
[7,{"$f":"IF(COC!A26=0,\"\",COC!A26)","v":""},{"$f":"IF(COC!A26=0,\"\",COC!E26)","v":""},{"$f":"IF(COC!A26=0,\"\",COC!D26)","v":""},{"$f":"IF(COC!A26=0,\"\",COC!F26)","v":""},null,null,null,false,null,null,7]
[8,{"$f":"IF(COC!A27=0,\"\",COC!A27)","v":""},{"$f":"IF(COC!A27=0,\"\",COC!E27)","v":""},{"$f":"IF(COC!A27=0,\"\",COC!D27)","v":""},{"$f":"IF(COC!A27=0,\"\",COC!F27)","v":""},null,null,null,false,null,null,8]
[9,{"$f":"IF(COC!A28=0,\"\",COC!A28)","v":""},{"$f":"IF(COC!A28=0,\"\",COC!E28)","v":""},{"$f":"IF(COC!A28=0,\"\",COC!D28)","v":""},{"$f":"IF(COC!A28=0,\"\",COC!F28)","v":""},null,null,null,false,null,null,9]
[10,{"$f":"IF(COC!A29=0,\"\",COC!A29)","v":""},{"$f":"IF(COC!A29=0,\"\",COC!E29)","v":""},{"$f":"IF(COC!A29=0,\"\",COC!D29)","v":""},{"$f":"IF(COC!A29=0,\"\",COC!F29)","v":""},null,null,null,false,null,null,10]
[11,{"$f":"IF(COC!A30=0,\"\",COC!A30)","v":""},{"$f":"IF(COC!A30=0,\"\",COC!E30)","v":""},{"$f":"IF(COC!A30=0,\"\",COC!D30)","v":""},{"$f":"IF(COC!A30=0,\"\",COC!F30)","v":""},null,null,null,false,null,null,11]
[12,{"$f":"IF(COC!A31=0,\"\",COC!A31)","v":""},{"$f":"IF(COC!A31=0,\"\",COC!E31)","v":""},{"$f":"IF(COC!A31=0,\"\",COC!D31)","v":""},{"$f":"IF(COC!A31=0,\"\",COC!F31)","v":""},null,null,null,false,null,null,12]
[13,{"$f":"IF(COC!A32=0,\"\",COC!A32)","v":""},{"$f":"IF(COC!A32=0,\"\",COC!E32)","v":""},{"$f":"IF(COC!A32=0,\"\",COC!D32)","v":""},{"$f":"IF(COC!A32=0,\"\",COC!F32)","v":""},null,null,null,false,null,null,13]
[14,{"$f":"IF(COC!A33=0,\"\",COC!A33)","v":""},{"$f":"IF(COC!A33=0,\"\",COC!E33)","v":""},{"$f":"IF(COC!A33=0,\"\",COC!D33)","v":""},{"$f":"IF(COC!A33=0,\"\",COC!F33)","v":""},null,null,null,false,null,null,14]
[15,{"$f":"IF(COC!A34=0,\"\",COC!A34)","v":""},{"$f":"IF(COC!A34=0,\"\",COC!E34)","v":""},{"$f":"IF(COC!A34=0,\"\",COC!D34)","v":""},{"$f":"IF(COC!A34=0,\"\",COC!F34)","v":""},null,null,null,false,null,null,15]
[16,{"$f":"IF(COC!A35=0,\"\",COC!A35)","v":""},{"$f":"IF(COC!A35=0,\"\",COC!E35)","v":""},{"$f":"IF(COC!A35=0,\"\",COC!D35)","v":""},{"$f":"IF(COC!A35=0,\"\",COC!F35)","v":""},null,null,null,false,null,null,16]
[17,{"$f":"IF(COC!A36=0,\"\",COC!A36)","v":""},{"$f":"IF(COC!A36=0,\"\",COC!E36)","v":""},{"$f":"IF(COC!A36=0,\"\",COC!D36)","v":""},{"$f":"IF(COC!A36=0,\"\",COC!F36)","v":""},null,null,null,false,null,null,17]
[18,{"$f":"IF(COC!A37=0,\"\",COC!A37)","v":""},{"$f":"IF(COC!A37=0,\"\",COC!E37)","v":""},{"$f":"IF(COC!A37=0,\"\",COC!D37)","v":""},{"$f":"IF(COC!A37=0,\"\",COC!F37)","v":""},null,null,null,false,null,null,18]
[19,{"$f":"IF(COC!A38=0,\"\",COC!A38)","v":""},{"$f":"IF(COC!A38=0,\"\",COC!E38)","v":""},{"$f":"IF(COC!A38=0,\"\",COC!D38)","v":""},{"$f":"IF(COC!A38=0,\"\",COC!F38)","v":""},null,null,null,false,null,null,19]
[20,{"$f":"IF(COC!A39=0,\"\",COC!A39)","v":""},{"$f":"IF(COC!A39=0,\"\",COC!E39)","v":""},{"$f":"IF(COC!A39=0,\"\",COC!D39)","v":""},{"$f":"IF(COC!A39=0,\"\",COC!F39)","v":""},null,null,null,false,null,null,20]
[]
[null,"Observaciones/ Novedades"]
[]
[]
[]
[]
[]
[null,null,null,null,"Informe de resultados"]
[null,"Realizó",null,null,null,"Revisó 1"]
[null,"Fecha",null,null,null,"Fecha"]
[null,"Observaciones"]
[]
[]
[]
[]
[]
[]
[]
[null,"Realizó",null,null,null,"Revisó 2"]
[null,"Fecha",null,null,null,"Fecha"]
[null,"Observaciones"]
[]
[]
[]
[]
[]
[]
[null,null,"Incidencia"]

{"sheet":"Titulación","index":4,"n_rows":70,"n_cols":16,"rows_kept":70,"cut":false,"hidden":true,"merged":[[61,2,61,4],[61,6,61,8],[62,1,68,1],[62,2,68,8],[3,1,3,9],[4,8,4,9],[5,8,5,9],[6,2,6,9],[7,1,7,9],[59,3,59,4],[59,5,59,6],[59,7,59,8],[60,2,60,4],[60,6,60,8],[50,2,50,4],[50,6,50,8],[51,2,51,4],[51,6,51,8],[52,1,58,1],[52,2,58,8],[12,7,12,9],[13,7,13,9],[14,4,14,9],[12,1,14,1],[12,2,12,3],[13,2,13,3],[14,2,14,3],[12,5,12,6],[13,5,13,6],[43,1,47,1],[49,4,49,6],[9,1,11,1],[11,5,11,9],[0,0,2,9],[9,2,10,2],[38,1,39,1],[9,3,10,3],[4,2,4,3],[4,4,4,5],[5,2,5,3],[5,4,5,5]]}
["Formato de analisis ambiental"]
[]
[]
[null,"Recepción de muestra"]
[null,"Movimiento",{"$f":"IF(COC!B1=0,\"\",COC!B1)","v":""},null,"Custodia",null,{"$f":"IF(COC!B1=0,\"\",COC!D1)","v":""},"Informe",{"$f":"IF(COC!B1=0,\"\",COC!F1)","v":""}]
[null,"Cantidad",{"$f":"IF(COC!B1=0,\"\",COC!B14)","v":""},null,"Fecha de recepción",null,{"$f":"IF(COC!B1=0,\"\",COC!B47)","v":""},"Hora ",{"$f":"IF(COC!$D$1=0,\"\",COC!E47)","v":""}]
[null,"Observaciones",{"$f":"IF(AND(COC!B49=0,COC!B15=0),\"Sin observaciones\",_xlfn.CONCAT(COC!B15,\"-\",COC!B49))","v":"Sin observaciones"}]
[null,"Análisis de muestras"]
[null,"Estandarización ","Código BaCl2 ",null,"Concentración BaCl2 (N)",null,"Realizó",null,"Lote"]
[null,"Análisis de muestras","Fecha de análisis",null,"VRB 1 (mL)",null,"V LOQ 1 (mL)",null,"VQc 1 (mL)"]
[null,null,null,null,"VRB 2 (mL)",null,"VLOQ 2 (mL)",null,"VQc 2 (mL)"]
[null,null,"Realizó",null,"Equipo"]
[null,"Controles","Diligenciamiento pureza reactivos",null,false,"Revisión pureza reactivos",null,false]
[null,null,"Carta control ",null,false,"Revisón Carta Control",null,false]
[null,null,"Códigos verificados (10%)"]
[]
["#","ID Laboratorio","Análisis","Método","Nivel","Vi (mL)","Vf (mL)","Va (mL)","Vs.iTW(mL)","Vs.iiTW(mL)","Bk",null,null,null,null,"unidades"]
[1,{"$f":"IF(COC!A20=0,\"\",COC!A20)","v":""},{"$f":"IF(COC!A20=0,\"\",COC!E20)","v":""},{"$f":"IF(COC!A20=0,\"\",COC!D20)","v":""},null,null,null,{"$f":"IF($G$5=0,\"\",IF(AND(D18=\"Ap. A-4 Método 8\",C18=\"SO3-H2SO4\"),100,IF(AND(D18=\"Ap. A-4 Método 8\",C18=\"SO2\"),10,20)))","v":20},null,null,false,null,null,1,null,"µg"]
[2,{"$f":"IF(COC!A21=0,\"\",COC!A21)","v":""},{"$f":"IF(COC!A21=0,\"\",COC!E21)","v":""},{"$f":"IF(COC!A21=0,\"\",COC!D21)","v":""},null,null,null,{"$f":"IF($G$5=0,\"\",IF(AND(D19=\"Ap. A-4 Método 8\",C19=\"SO3-H2SO4\"),100,IF(AND(D19=\"Ap. A-4 Método 8\",C19=\"SO2\"),10,20)))","v":20},null,null,false,null,null,2,null,"mg"]
[3,{"$f":"IF(COC!A22=0,\"\",COC!A22)","v":""},{"$f":"IF(COC!A22=0,\"\",COC!E22)","v":""},{"$f":"IF(COC!A22=0,\"\",COC!D22)","v":""},null,null,null,20,null,null,false,null,null,3,null,"g"]
[4,{"$f":"IF(COC!A23=0,\"\",COC!A23)","v":""},{"$f":"IF(COC!A23=0,\"\",COC!E23)","v":""},{"$f":"IF(COC!A23=0,\"\",COC!D23)","v":""},null,null,null,20,null,null,false,null,null,4,null,"kg"]
[5,{"$f":"IF(COC!A24=0,\"\",COC!A24)","v":""},{"$f":"IF(COC!A24=0,\"\",COC!E24)","v":""},{"$f":"IF(COC!A24=0,\"\",COC!D24)","v":""},null,null,null,20,null,null,false,null,null,5]
[6,{"$f":"IF(COC!A25=0,\"\",COC!A25)","v":""},{"$f":"IF(COC!A25=0,\"\",COC!E25)","v":""},{"$f":"IF(COC!A25=0,\"\",COC!D25)","v":""},null,null,null,20,null,null,false,null,null,6]
[7,{"$f":"IF(COC!A26=0,\"\",COC!A26)","v":""},{"$f":"IF(COC!A26=0,\"\",COC!E26)","v":""},{"$f":"IF(COC!A26=0,\"\",COC!D26)","v":""},null,null,null,20,null,null,false,null,null,7]
[8,{"$f":"IF(COC!A27=0,\"\",COC!A27)","v":""},{"$f":"IF(COC!A27=0,\"\",COC!E27)","v":""},{"$f":"IF(COC!A27=0,\"\",COC!D27)","v":""},null,null,null,20,null,null,false,null,null,8]
[9,{"$f":"IF(COC!A28=0,\"\",COC!A28)","v":""},{"$f":"IF(COC!A28=0,\"\",COC!E28)","v":""},{"$f":"IF(COC!A28=0,\"\",COC!D28)","v":""},null,null,null,20,null,null,false,null,null,9]
[10,{"$f":"IF(COC!A29=0,\"\",COC!A29)","v":""},{"$f":"IF(COC!A29=0,\"\",COC!E29)","v":""},{"$f":"IF(COC!A29=0,\"\",COC!D29)","v":""},null,null,null,20,null,null,false,null,null,10]
[11,{"$f":"IF(COC!A30=0,\"\",COC!A30)","v":""},{"$f":"IF(COC!A30=0,\"\",COC!E30)","v":""},{"$f":"IF(COC!A30=0,\"\",COC!D30)","v":""},null,null,null,20,null,null,false,null,null,11]
[12,{"$f":"IF(COC!A31=0,\"\",COC!A31)","v":""},{"$f":"IF(COC!A31=0,\"\",COC!E31)","v":""},{"$f":"IF(COC!A31=0,\"\",COC!D31)","v":""},null,null,null,20,null,null,false,null,null,12]
[13,{"$f":"IF(COC!A32=0,\"\",COC!A32)","v":""},{"$f":"IF(COC!A32=0,\"\",COC!E32)","v":""},{"$f":"IF(COC!A32=0,\"\",COC!D32)","v":""},null,null,null,20,null,null,false,null,null,13]
[14,{"$f":"IF(COC!A33=0,\"\",COC!A33)","v":""},{"$f":"IF(COC!A33=0,\"\",COC!E33)","v":""},{"$f":"IF(COC!A33=0,\"\",COC!D33)","v":""},null,null,null,20,null,null,false,null,null,14]
[15,{"$f":"IF(COC!A34=0,\"\",COC!A34)","v":""},{"$f":"IF(COC!A34=0,\"\",COC!E34)","v":""},{"$f":"IF(COC!A34=0,\"\",COC!D34)","v":""},null,null,null,20,null,null,false,null,null,15]
[16,{"$f":"IF(COC!A35=0,\"\",COC!A35)","v":""},{"$f":"IF(COC!A35=0,\"\",COC!E35)","v":""},{"$f":"IF(COC!A35=0,\"\",COC!D35)","v":""},null,null,null,20,null,null,false,null,null,16]
[17,{"$f":"IF(COC!A36=0,\"\",COC!A36)","v":""},{"$f":"IF(COC!A36=0,\"\",COC!E36)","v":""},{"$f":"IF(COC!A36=0,\"\",COC!D36)","v":""},null,null,null,20,null,null,false,null,null,17]
[18,{"$f":"IF(COC!A37=0,\"\",COC!A37)","v":""},{"$f":"IF(COC!A37=0,\"\",COC!E37)","v":""},{"$f":"IF(COC!A37=0,\"\",COC!D37)","v":""},null,null,null,20,null,null,false,null,null,18]
[19,{"$f":"IF(COC!A38=0,\"\",COC!A38)","v":""},{"$f":"IF(COC!A38=0,\"\",COC!E38)","v":""},{"$f":"IF(COC!A38=0,\"\",COC!D38)","v":""},null,null,null,20,null,null,false,null,null,19]
[20,{"$f":"IF(COC!A39=0,\"\",COC!A39)","v":""},{"$f":"IF(COC!A39=0,\"\",COC!E39)","v":""},{"$f":"IF(COC!A39=0,\"\",COC!D39)","v":""},null,null,null,20,null,null,false,null,null,20]
[]
[null,"Convenciones","Vi: Volumen inicial de la muestra",null,null,"VRB: Volumen gastado de titulante para blanco de laboratorio"]
[null,null,"Vf: Volumen final de la muestra",null,null,"VLOQ: Volumen gastado de titulante para el limite de cuantificación "]
[null,null,"Vs.iTW: Volumen gastado de titulante ensayo 1",null,null,"VQC: Volumen gastado de titulante para el control de calidad"]
[null,null,"Vs.iiTW: Volumen gastado de titulante ensayo 2",null,null,"Va: Volumen de alicuota a titular"]
[]
[null,"Observaciones/ Novedades"]
[]
[]
[]
[]
[]
[null,null,null,null,"Informe de resultados"]
[null,"Realizó",null,null,null,"Revisó 1"]
[null,"Fecha",null,null,null,"Fecha"]
[null,"Observaciones"]
[]
[]
[]
[]
[]
[]
[]
[null,"Realizó",null,null,null,"Revisó 2"]
[null,"Fecha",null,null,null,"Fecha"]
[null,"Observaciones"]
[]
[]
[]
[]
[]
[]
[null,null,"Incidencia"]

{"sheet":"Cromatografía gases","index":5,"n_rows":74,"n_cols":11,"rows_kept":74,"cut":false,"hidden":true,"merged":[[54,2,54,4],[54,6,54,8],[55,2,55,4],[55,6,55,8],[13,7,15,7],[16,7,18,7],[10,5,18,5],[10,3,12,3],[0,0,2,9],[65,2,65,4],[65,6,65,8],[66,1,72,1],[66,2,72,8],[56,1,62,1],[56,2,62,8],[63,3,63,4],[63,5,63,6],[63,7,63,8],[8,1,9,1],[8,2,8,3],[9,2,9,3],[64,2,64,4],[64,6,64,8],[19,3,19,4],[47,1,51,1],[53,4,53,6],[19,1,19,2],[22,6,41,6],[3,1,3,8],[4,2,4,3],[4,4,4,5],[5,2,5,3],[5,4,5,5],[10,7,12,7],[8,4,8,8],[13,3,15,3],[16,3,18,3],[6,2,6,8],[7,1,7,8],[10,1,18,1]]}
["Formato de analisis ambiental"]
[]
[]
[null,"Recepción de muestra"]
[null,"Movimiento",{"$f":"IF(COC!B1=0,\"\",COC!B1)","v":""},null,"Custodia",null,{"$f":"IF(COC!B1=0,\"\",COC!D1)","v":""},"Informe",{"$f":"IF(COC!B1=0,\"\",COC!F1)","v":""}]
[null,"Cantidad",{"$f":"IF(COC!B1=0,\"\",COC!B14)","v":""},null,"Fecha de recepción",null,{"$f":"IF(COC!B1=0,\"\",COC!B47)","v":""},"Hora ",{"$f":"IF(COC!$D$1=0,\"\",COC!E47)","v":""}]
[null,"Observaciones",{"$f":"IF(AND(COC!B49=0,COC!B15=0),\"Sin observaciones\",_xlfn.CONCAT(COC!B15,\"-\",COC!B49))","v":"Sin observaciones"}]
[null,"Análisis de muestras",null,null,"Analisis de las muestras"]
[null,"Equipo","CI "]
[null,null,"Almacenamiento",null,null,null,null,"Refrigeración"]
[null,"Fecha desorción",null,"Código LCSB",null,"Realizó",null,"Revisión Carta Control",false]
[null,null,null,null,null,null,null,null,false]
[null,null,null,null,null,null,null,null,false]
[null,null,null,"Código LCSM",null,null,null,"Revisión Carta Control",false]
[null,null,null,null,null,null,null,null,false]
[null,null,null,null,null,null,null,null,false]
[null,null,null,"Código ICV",null,null,null,"Revisión Carta Control",false]
[null,null,null,null,null,null,null,null,false]
[null,null,null,null,null,null,null,null,false]
[null,"Códigos verificados (10%)",null,null,null,"Fecha curva utilizada"]
[]
[null,"#","ID Laboratorio","Análisis","Método","Medio ","Fecha Desorción","V Desorción  (mL)","Cromatógrafo"]
[null,1,{"$f":"IF(COC!A20=0,\"\",COC!A20)","v":""},{"$f":"IF(COC!A20=0,\"\",COC!E20)","v":""},{"$f":"IF(COC!A20=0,\"\",COC!D20)","v":""},{"$f":"IF(COC!A20=0,\"\",COC!F20)","v":""},null,null,null,null,1]
[null,2,{"$f":"IF(COC!A21=0,\"\",COC!A21)","v":""},{"$f":"IF(COC!A21=0,\"\",COC!E21)","v":""},{"$f":"IF(COC!A21=0,\"\",COC!D21)","v":""},{"$f":"IF(COC!A21=0,\"\",COC!F21)","v":""},null,null,null,null,2]
[null,3,{"$f":"IF(COC!A22=0,\"\",COC!A22)","v":""},{"$f":"IF(COC!A22=0,\"\",COC!E22)","v":""},{"$f":"IF(COC!A22=0,\"\",COC!D22)","v":""},{"$f":"IF(COC!A22=0,\"\",COC!F22)","v":""},null,null,null,null,3]
[null,4,{"$f":"IF(COC!A23=0,\"\",COC!A23)","v":""},{"$f":"IF(COC!A23=0,\"\",COC!E23)","v":""},{"$f":"IF(COC!A23=0,\"\",COC!D23)","v":""},{"$f":"IF(COC!A23=0,\"\",COC!F23)","v":""},null,null,null,null,4]
[null,5,{"$f":"IF(COC!A24=0,\"\",COC!A24)","v":""},{"$f":"IF(COC!A24=0,\"\",COC!E24)","v":""},{"$f":"IF(COC!A24=0,\"\",COC!D24)","v":""},{"$f":"IF(COC!A24=0,\"\",COC!F24)","v":""},null,null,null,null,5]
[null,6,{"$f":"IF(COC!A25=0,\"\",COC!A25)","v":""},{"$f":"IF(COC!A25=0,\"\",COC!E25)","v":""},{"$f":"IF(COC!A25=0,\"\",COC!D25)","v":""},{"$f":"IF(COC!A25=0,\"\",COC!F25)","v":""},null,null,null,null,6]
[null,7,{"$f":"IF(COC!A26=0,\"\",COC!A26)","v":""},{"$f":"IF(COC!A26=0,\"\",COC!E26)","v":""},{"$f":"IF(COC!A26=0,\"\",COC!D26)","v":""},{"$f":"IF(COC!A26=0,\"\",COC!F26)","v":""},null,null,null,null,7]
[null,8,{"$f":"IF(COC!A27=0,\"\",COC!A27)","v":""},{"$f":"IF(COC!A27=0,\"\",COC!E27)","v":""},{"$f":"IF(COC!A27=0,\"\",COC!D27)","v":""},{"$f":"IF(COC!A27=0,\"\",COC!F27)","v":""},null,null,null,null,8]
[null,9,{"$f":"IF(COC!A28=0,\"\",COC!A28)","v":""},{"$f":"IF(COC!A28=0,\"\",COC!E28)","v":""},{"$f":"IF(COC!A28=0,\"\",COC!D28)","v":""},{"$f":"IF(COC!A28=0,\"\",COC!F28)","v":""},null,null,null,null,9]
[null,10,{"$f":"IF(COC!A29=0,\"\",COC!A29)","v":""},{"$f":"IF(COC!A29=0,\"\",COC!E29)","v":""},{"$f":"IF(COC!A29=0,\"\",COC!D29)","v":""},{"$f":"IF(COC!A29=0,\"\",COC!F29)","v":""},null,null,null,null,10]
[null,11,{"$f":"IF(COC!A30=0,\"\",COC!A30)","v":""},{"$f":"IF(COC!A30=0,\"\",COC!E30)","v":""},{"$f":"IF(COC!A30=0,\"\",COC!D30)","v":""},{"$f":"IF(COC!A30=0,\"\",COC!F30)","v":""},null,null,null,null,11]
[null,12,{"$f":"IF(COC!A31=0,\"\",COC!A31)","v":""},{"$f":"IF(COC!A31=0,\"\",COC!E31)","v":""},{"$f":"IF(COC!A31=0,\"\",COC!D31)","v":""},{"$f":"IF(COC!A31=0,\"\",COC!F31)","v":""},null,null,null,null,12]
[null,13,{"$f":"IF(COC!A32=0,\"\",COC!A32)","v":""},{"$f":"IF(COC!A32=0,\"\",COC!E32)","v":""},{"$f":"IF(COC!A32=0,\"\",COC!D32)","v":""},{"$f":"IF(COC!A32=0,\"\",COC!F32)","v":""},null,null,null,null,13]
[null,14,{"$f":"IF(COC!A33=0,\"\",COC!A33)","v":""},{"$f":"IF(COC!A33=0,\"\",COC!E33)","v":""},{"$f":"IF(COC!A33=0,\"\",COC!D33)","v":""},{"$f":"IF(COC!A33=0,\"\",COC!F33)","v":""},null,null,null,null,14]
[null,15,{"$f":"IF(COC!A34=0,\"\",COC!A34)","v":""},{"$f":"IF(COC!A34=0,\"\",COC!E34)","v":""},{"$f":"IF(COC!A34=0,\"\",COC!D34)","v":""},{"$f":"IF(COC!A34=0,\"\",COC!F34)","v":""},null,null,null,null,15]
[null,16,{"$f":"IF(COC!A35=0,\"\",COC!A35)","v":""},{"$f":"IF(COC!A35=0,\"\",COC!E35)","v":""},{"$f":"IF(COC!A35=0,\"\",COC!D35)","v":""},{"$f":"IF(COC!A35=0,\"\",COC!F35)","v":""},null,null,null,null,16]
[null,17,{"$f":"IF(COC!A36=0,\"\",COC!A36)","v":""},{"$f":"IF(COC!A36=0,\"\",COC!E36)","v":""},{"$f":"IF(COC!A36=0,\"\",COC!D36)","v":""},{"$f":"IF(COC!A36=0,\"\",COC!F36)","v":""},null,null,null,null,17]
[null,18,{"$f":"IF(COC!A37=0,\"\",COC!A37)","v":""},{"$f":"IF(COC!A37=0,\"\",COC!E37)","v":""},{"$f":"IF(COC!A37=0,\"\",COC!D37)","v":""},{"$f":"IF(COC!A37=0,\"\",COC!F37)","v":""},null,null,null,null,18]
[null,19,{"$f":"IF(COC!A38=0,\"\",COC!A38)","v":""},{"$f":"IF(COC!A38=0,\"\",COC!E38)","v":""},{"$f":"IF(COC!A38=0,\"\",COC!D38)","v":""},{"$f":"IF(COC!A38=0,\"\",COC!F38)","v":""},null,null,null,null,19]
[null,20,{"$f":"IF(COC!A39=0,\"\",COC!A39)","v":""},{"$f":"IF(COC!A39=0,\"\",COC!E39)","v":""},{"$f":"IF(COC!A39=0,\"\",COC!D39)","v":""},{"$f":"IF(COC!A39=0,\"\",COC!F39)","v":""},null,null,null,null,20]
[]
[]
[]
[]
[]
[null,"Observaciones/ Novedades"]
[]
[]
[]
[]
[]
[null,null,null,null,"Informe de resultados"]
[null,"Realizó",null,null,null,"Revisó 1"]
[null,"Fecha",null,null,null,"Fecha"]
[null,"Observaciones"]
[]
[]
[]
[]
[]
[]
[]
[null,"Realizó",null,null,null,"Revisó 2"]
[null,"Fecha",null,null,null,"Fecha"]
[null,"Observaciones"]
[]
[]
[]
[]
[]
[]
[null,null,"Incidencia"]

{"sheet":"Cromatografía iónica","index":6,"n_rows":68,"n_cols":13,"rows_kept":68,"cut":false,"hidden":true,"merged":[[4,2,4,3],[4,4,4,5],[5,2,5,3],[5,4,5,5],[0,0,2,9],[3,1,3,8],[6,2,6,8],[7,1,7,8],[44,1,48,1],[50,4,50,6],[51,3,51,4],[51,5,51,6],[51,7,51,8],[11,3,13,3],[14,3,16,3],[9,6,9,8],[60,1,66,1],[60,2,66,8],[52,1,58,1],[52,2,58,8],[59,3,59,4],[59,5,59,6],[59,7,59,8]]}
["Formato de analisis ambiental"]
[]
[]
[null,"Recepción de muestra"]
[null,"Movimiento",{"$f":"COC!B1","v":0},null,"Custodia",null,{"$f":"COC!D1","v":0},"Informe",{"$f":"COC!F1","v":0}]
[null,"Cantidad",{"$f":"COC!B14","v":0},null,"Fecha de recepción",null,{"$f":"COC!B47","v":"00:00:00"},"Hora ",{"$f":"COC!E47","v":"00:00:00"}]
[null,"Observaciones",{"$f":"IF(AND(COC!B49=0,COC!B15=0),\"Sin observaciones\",_xlfn.CONCAT(COC!B15,\"-\",COC!B49))","v":"Sin observaciones"}]
[null,"Análisis de muestras",null,null,"Analisis de las muestras"]
[null,"Conductividad agua Tipo I",null,"Tipo eluyente",null,"Fecha de preparación ",null,"Responsable"]
[null,"Carta control ",false,"Revisión Carta Control",false,"Códigos verificados (10%)"]
[null,"Muestras enriquecidas "]
[]
[]
[]
[]
[]
[]
[]
["#","Consecutivo custodia","ID ","Análisis","Método","Medio ","Fecha análisis","Volumen (mL)","Nivel","Bk"]
[1,{"$f":"IF(COC!A20=0,\"\",_xlfn.CONCAT($G$5,\"-\",M20))","v":""},{"$f":"IF(COC!A20=0,\"\",(IF(COC!B20=0,COC!A20,_xlfn.CONCAT(COC!A20,\"-\",COC!B20))))","v":""},{"$f":"IF(COC!A20=0,\"\",COC!E20)","v":""},{"$f":"IF(COC!A20=0,\"\",COC!D20)","v":""},{"$f":"IF(COC!A20=0,\"\",COC!F20)","v":""},null,null,false,false,null,null,1]
[2,{"$f":"IF(COC!A21=0,\"\",_xlfn.CONCAT($G$5,\"-\",M21))","v":""},{"$f":"IF(COC!A21=0,\"\",(IF(COC!B21=0,COC!A21,_xlfn.CONCAT(COC!A21,\"-\",COC!B21))))","v":""},{"$f":"IF(COC!A21=0,\"\",COC!E21)","v":""},{"$f":"IF(COC!A21=0,\"\",COC!D21)","v":""},{"$f":"IF(COC!A21=0,\"\",COC!F21)","v":""},null,null,false,false,null,null,2]
[3,{"$f":"IF(COC!A22=0,\"\",_xlfn.CONCAT($G$5,\"-\",M22))","v":""},{"$f":"IF(COC!A22=0,\"\",(IF(COC!B22=0,COC!A22,_xlfn.CONCAT(COC!A22,\"-\",COC!B22))))","v":""},{"$f":"IF(COC!A22=0,\"\",COC!E22)","v":""},{"$f":"IF(COC!A22=0,\"\",COC!D22)","v":""},{"$f":"IF(COC!A22=0,\"\",COC!F22)","v":""},null,null,false,false,null,null,3]
[4,{"$f":"IF(COC!A23=0,\"\",_xlfn.CONCAT($G$5,\"-\",M23))","v":""},{"$f":"IF(COC!A23=0,\"\",(IF(COC!B23=0,COC!A23,_xlfn.CONCAT(COC!A23,\"-\",COC!B23))))","v":""},{"$f":"IF(COC!A23=0,\"\",COC!E23)","v":""},{"$f":"IF(COC!A23=0,\"\",COC!D23)","v":""},{"$f":"IF(COC!A23=0,\"\",COC!F23)","v":""},null,null,false,false,null,null,4]
[5,{"$f":"IF(COC!A24=0,\"\",_xlfn.CONCAT($G$5,\"-\",M24))","v":""},{"$f":"IF(COC!A24=0,\"\",(IF(COC!B24=0,COC!A24,_xlfn.CONCAT(COC!A24,\"-\",COC!B24))))","v":""},{"$f":"IF(COC!A24=0,\"\",COC!E24)","v":""},{"$f":"IF(COC!A24=0,\"\",COC!D24)","v":""},{"$f":"IF(COC!A24=0,\"\",COC!F24)","v":""},null,null,false,false,null,null,5]
[6,{"$f":"IF(COC!A25=0,\"\",_xlfn.CONCAT($G$5,\"-\",M25))","v":""},{"$f":"IF(COC!A25=0,\"\",(IF(COC!B25=0,COC!A25,_xlfn.CONCAT(COC!A25,\"-\",COC!B25))))","v":""},{"$f":"IF(COC!A25=0,\"\",COC!E25)","v":""},{"$f":"IF(COC!A25=0,\"\",COC!D25)","v":""},{"$f":"IF(COC!A25=0,\"\",COC!F25)","v":""},null,null,false,false,null,null,6]
[7,{"$f":"IF(COC!A26=0,\"\",_xlfn.CONCAT($G$5,\"-\",M26))","v":""},{"$f":"IF(COC!A26=0,\"\",(IF(COC!B26=0,COC!A26,_xlfn.CONCAT(COC!A26,\"-\",COC!B26))))","v":""},{"$f":"IF(COC!A26=0,\"\",COC!E26)","v":""},{"$f":"IF(COC!A26=0,\"\",COC!D26)","v":""},{"$f":"IF(COC!A26=0,\"\",COC!F26)","v":""},null,null,false,false,null,null,7]
[8,{"$f":"IF(COC!A27=0,\"\",_xlfn.CONCAT($G$5,\"-\",M27))","v":""},{"$f":"IF(COC!A27=0,\"\",(IF(COC!B27=0,COC!A27,_xlfn.CONCAT(COC!A27,\"-\",COC!B27))))","v":""},{"$f":"IF(COC!A27=0,\"\",COC!E27)","v":""},{"$f":"IF(COC!A27=0,\"\",COC!D27)","v":""},{"$f":"IF(COC!A27=0,\"\",COC!F27)","v":""},null,null,false,false,null,null,8]
[9,{"$f":"IF(COC!A28=0,\"\",_xlfn.CONCAT($G$5,\"-\",M28))","v":""},{"$f":"IF(COC!A28=0,\"\",(IF(COC!B28=0,COC!A28,_xlfn.CONCAT(COC!A28,\"-\",COC!B28))))","v":""},{"$f":"IF(COC!A28=0,\"\",COC!E28)","v":""},{"$f":"IF(COC!A28=0,\"\",COC!D28)","v":""},{"$f":"IF(COC!A28=0,\"\",COC!F28)","v":""},null,null,false,false,null,null,9]
[10,{"$f":"IF(COC!A29=0,\"\",_xlfn.CONCAT($G$5,\"-\",M29))","v":""},{"$f":"IF(COC!A29=0,\"\",(IF(COC!B29=0,COC!A29,_xlfn.CONCAT(COC!A29,\"-\",COC!B29))))","v":""},{"$f":"IF(COC!A29=0,\"\",COC!E29)","v":""},{"$f":"IF(COC!A29=0,\"\",COC!D29)","v":""},{"$f":"IF(COC!A29=0,\"\",COC!F29)","v":""},null,null,false,false,null,null,10]
[11,{"$f":"IF(COC!A30=0,\"\",_xlfn.CONCAT($G$5,\"-\",M30))","v":""},{"$f":"IF(COC!A30=0,\"\",(IF(COC!B30=0,COC!A30,_xlfn.CONCAT(COC!A30,\"-\",COC!B30))))","v":""},{"$f":"IF(COC!A30=0,\"\",COC!E30)","v":""},{"$f":"IF(COC!A30=0,\"\",COC!D30)","v":""},{"$f":"IF(COC!A30=0,\"\",COC!F30)","v":""},null,null,false,false,null,null,11]
[12,{"$f":"IF(COC!A31=0,\"\",_xlfn.CONCAT($G$5,\"-\",M31))","v":""},{"$f":"IF(COC!A31=0,\"\",(IF(COC!B31=0,COC!A31,_xlfn.CONCAT(COC!A31,\"-\",COC!B31))))","v":""},{"$f":"IF(COC!A31=0,\"\",COC!E31)","v":""},{"$f":"IF(COC!A31=0,\"\",COC!D31)","v":""},{"$f":"IF(COC!A31=0,\"\",COC!F31)","v":""},null,null,false,false,null,null,12]
[13,{"$f":"IF(COC!A32=0,\"\",_xlfn.CONCAT($G$5,\"-\",M32))","v":""},{"$f":"IF(COC!A32=0,\"\",(IF(COC!B32=0,COC!A32,_xlfn.CONCAT(COC!A32,\"-\",COC!B32))))","v":""},{"$f":"IF(COC!A32=0,\"\",COC!E32)","v":""},{"$f":"IF(COC!A32=0,\"\",COC!D32)","v":""},{"$f":"IF(COC!A32=0,\"\",COC!F32)","v":""},null,null,false,false,null,null,13]
[14,{"$f":"IF(COC!A33=0,\"\",_xlfn.CONCAT($G$5,\"-\",M33))","v":""},{"$f":"IF(COC!A33=0,\"\",(IF(COC!B33=0,COC!A33,_xlfn.CONCAT(COC!A33,\"-\",COC!B33))))","v":""},{"$f":"IF(COC!A33=0,\"\",COC!E33)","v":""},{"$f":"IF(COC!A33=0,\"\",COC!D33)","v":""},{"$f":"IF(COC!A33=0,\"\",COC!F33)","v":""},null,null,false,false,null,null,14]
[15,{"$f":"IF(COC!A34=0,\"\",_xlfn.CONCAT($G$5,\"-\",M34))","v":""},{"$f":"IF(COC!A34=0,\"\",(IF(COC!B34=0,COC!A34,_xlfn.CONCAT(COC!A34,\"-\",COC!B34))))","v":""},{"$f":"IF(COC!A34=0,\"\",COC!E34)","v":""},{"$f":"IF(COC!A34=0,\"\",COC!D34)","v":""},{"$f":"IF(COC!A34=0,\"\",COC!F34)","v":""},null,null,false,false,null,null,15]
[16,{"$f":"IF(COC!A35=0,\"\",_xlfn.CONCAT($G$5,\"-\",M35))","v":""},{"$f":"IF(COC!A35=0,\"\",(IF(COC!B35=0,COC!A35,_xlfn.CONCAT(COC!A35,\"-\",COC!B35))))","v":""},{"$f":"IF(COC!A35=0,\"\",COC!E35)","v":""},{"$f":"IF(COC!A35=0,\"\",COC!D35)","v":""},{"$f":"IF(COC!A35=0,\"\",COC!F35)","v":""},null,null,false,false,null,null,16]
[17,{"$f":"IF(COC!A36=0,\"\",_xlfn.CONCAT($G$5,\"-\",M36))","v":""},{"$f":"IF(COC!A36=0,\"\",(IF(COC!B36=0,COC!A36,_xlfn.CONCAT(COC!A36,\"-\",COC!B36))))","v":""},{"$f":"IF(COC!A36=0,\"\",COC!E36)","v":""},{"$f":"IF(COC!A36=0,\"\",COC!D36)","v":""},{"$f":"IF(COC!A36=0,\"\",COC!F36)","v":""},null,null,false,false,null,null,17]
[18,{"$f":"IF(COC!A37=0,\"\",_xlfn.CONCAT($G$5,\"-\",M37))","v":""},{"$f":"IF(COC!A37=0,\"\",(IF(COC!B37=0,COC!A37,_xlfn.CONCAT(COC!A37,\"-\",COC!B37))))","v":""},{"$f":"IF(COC!A37=0,\"\",COC!E37)","v":""},{"$f":"IF(COC!A37=0,\"\",COC!D37)","v":""},{"$f":"IF(COC!A37=0,\"\",COC!F37)","v":""},null,null,false,false,null,null,18]
[19,{"$f":"IF(COC!A38=0,\"\",_xlfn.CONCAT($G$5,\"-\",M38))","v":""},{"$f":"IF(COC!A38=0,\"\",(IF(COC!B38=0,COC!A38,_xlfn.CONCAT(COC!A38,\"-\",COC!B38))))","v":""},{"$f":"IF(COC!A38=0,\"\",COC!E38)","v":""},{"$f":"IF(COC!A38=0,\"\",COC!D38)","v":""},{"$f":"IF(COC!A38=0,\"\",COC!F38)","v":""},null,null,false,false,null,null,19]
[20,{"$f":"IF(COC!A39=0,\"\",_xlfn.CONCAT($G$5,\"-\",M39))","v":""},{"$f":"IF(COC!A39=0,\"\",(IF(COC!B39=0,COC!A39,_xlfn.CONCAT(COC!A39,\"-\",COC!B39))))","v":""},{"$f":"IF(COC!A39=0,\"\",COC!E39)","v":""},{"$f":"IF(COC!A39=0,\"\",COC!D39)","v":""},{"$f":"IF(COC!A39=0,\"\",COC!F39)","v":""},null,null,false,false,null,null,20]
[]
[]
[]
[]
[]
[null,"Observaciones/ Novedades"]
[]
[]
[]
[]
[]
[null,null,null,null,"Informe de resultados"]
[null,null,"Realizó",null,null,"Revisó 1"]
[null,"Observaciones"]
[]
[]
[]
[]
[]
[]
[null,null,"Realizó",null,null,"Revisó 2"]
[null,"Observaciones"]
[]
[]
[]
[]
[]
[]
[null,null,"Incidencia"]

{"sheet":"Descripcion","index":7,"n_rows":111,"n_cols":11,"rows_kept":111,"cut":false,"hidden":true,"merged":[[0,0,2,10]]}
["Formato de analisis ambiental"]
[]
[]
[]
[null,null,"Medio de retención",null,"Método","Análisis",null,"Análisis","Medio de retención",null,"Métodos"]
[null,null,"F. PTFE 46.2 mm",null,"Apéndice L","PM2.5",null,"PM2.5","F. PTFE 46.2 mm",null,"Apéndice L"]
[null,null,"F. GF 47 mm",null,"Apéndice J","PM10",null,"PM2.5","F. GF 47 mm",null,"Apéndice J"]
[null,null,"F. Cuarzo 47 mm",null,"Apéndice B","PST",null,"PM2.5","F. Cuarzo 47 mm",null,"Apéndice B"]
[null,null,"F. GF 82.6 mm",null,"Ap. A-2 Método de la pararrosanilina","SO2",null,"PM10","F. GF 47 mm",null,"Ap. A-2 Método de la pararrosanilina"]
[null,null,"F. GF 203 mm x 254 mm",null,"Ap. A-3 Método 5","Material Particulado",null,"PM10","F. Cuarzo 47 mm",null,"Ap. A-3 Método 5"]
[null,null,"F. Cuarzo 203 mm x 254 mm",null,"Ap. A-4 Método 6","SO2",null,"PM10","F. GF 203 mm x 254 mm",null,"Ap. A-4 Método 6"]
[null,null,"Acetona",null,"Ap. A-4 Método 7","NOX",null,"PM10","F. Cuarzo 203 mm x 254 mm",null,"Ap. A-4 Método 7"]
[null,null,"S.A. IPA 80% - GFF",null,"Ap. A-4 Método 7A","NOX",null,"PM10","F. PTFE 46.2 mm",null,"Ap. A-4 Método 7A"]
[null,null,"S.A. H2O2 3%",null,"Ap. A-4 Método 8","SO2",null,"PST","F. GF 203 mm x 254 mm",null,"Ap. A-4 Método 8"]
[null,null,"S.A. H2SO4-H2O2",null,"Ap. A-4 Método 8","SO3-H2SO4",null,"PST","F. Cuarzo 203 mm x 254 mm",null,"Ap. A-6 Método 18"]
[null,null,"S.A. 0.04M TCM",null,"Ap. A-6 Método 18","BTEX",null,"SO2","S.A. 0.04M TCM",null,"Ap. A-7 Método 23"]
[null,null,"SKC 226-01",null,"Ap. A-6 Método 18","HCT's como n-hexano",null,"SO2","S.A. H2O2 3%",null,"Ap. A-8 Método 26A"]
[null,null,"SKC 226-09",null,"Ap. A-6 Método 18","HCT's como metano",null,"NOX","S.A. H2SO4-H2O2",null,"Ap. A-8 Método 29"]
[null,null,"ZST-001",null,"Ap. A-7 Método 23","Dioxinas y furanos",null,"Material Particulado","F. GF 82.6 mm",null,"EPA Método CTM-027"]
[null,null,"ZST-022",null,"Ap. A-8 Método 26A","Haluros de hidrógeno ",null,"Material Particulado","Acetona",null,"NIOSH 5506"]
[null,null,"ORBO 32S",null,"Ap. A-8 Método 26A","Halógenos",null,"SO3-H2SO4","S.A. IPA 80% - GFF",null,"NIOSH 5515"]
[null,null,"ORBO 32L",null,"Ap. A-8 Método 26A","HF",null,"BTEX","SKC 226-01",null,"EPA Método TO-17"]
[null,null,"H2SO4 0.1N",null,"Ap. A-8 Método 26A","HCl",null,"BTEX","SKC 226-09",null,"Otro"]
[null,null,"NaOH 0.1N",null,"Ap. A-8 Método 26A","HBr",null,"BTEX","ZST-001"]
[null,null,"S.A. 5% HNO3/10% H2O2",null,"Ap. A-8 Método 26A","Cl2",null,"BTEX","ZST-022"]
[null,null,"S.A. 4% KMnO4/10% H2SO4",null,"Ap. A-8 Método 26A","Br2",null,"BTEX","ORBO 32S"]
[null,null,"Tolueno",null,"Ap. A-8 Método 29","Arsénico (As)",null,"BTEX","ORBO 32L"]
[null,null,"Hexano",null,"Ap. A-8 Método 29","Plomo (Pb)",null,"HCT's como n-hexano","SKC 226-01"]
[null,null,"Resina",null,"Ap. A-8 Método 29","Cobre (Cu)",null,"HCT's como n-hexano","SKC 226-09"]
[null,null,"Otro",null,"Ap. A-8 Método 29","Estaño (Sn)",null,"HCT's como n-hexano","ZST-001"]
[null,null,null,null,"Ap. A-8 Método 29","Cromo (Cr)",null,"HCT's como n-hexano","ZST-022"]
[null,null,null,null,"Ap. A-8 Método 29","Cobalto (Co)",null,"HCT's como n-hexano","ORBO 32S"]
[null,null,null,null,"Ap. A-8 Método 29","Manganeso (Mg)",null,"HCT's como n-hexano","ORBO 32L"]
[null,null,null,null,"Ap. A-8 Método 29","Niquel (Ni)",null,"HCT's como metano","SKC 226-01"]
[null,null,null,null,"Ap. A-8 Método 29","Vanadio (V)",null,"HCT's como metano","SKC 226-09"]
[null,null,null,null,"Ap. A-8 Método 29","Antimonio (Sb)",null,"HCT's como metano","ZST-001"]
[null,null,null,null,"Ap. A-8 Método 29","Mercurio (Hg)",null,"HCT's como metano","ZST-022"]
[null,null,null,null,"Ap. A-8 Método 29","Metales ",null,"HCT's como metano","ORBO 32S"]
[null,null,null,null,"EPA Método CTM-027","Amoniaco (NH3)",null,"HCT's como metano","ORBO 32L"]
[null,null,null,null,"NIOSH 5506","PAH's","PAH's","Dioxinas y furanos","Tolueno"]
[null,null,null,null,"NIOSH 5515","PAH's","PAH's","Dioxinas y furanos","Hexano"]
[null,null,null,null,"EPA Método TO-17","COV's","COV's","Dioxinas y furanos","Resina"]
[null,null,null,null,"Otro","Otro","Otro","Dioxinas y furanos","Otro"]
[null,null,null,null,null,null,null,"Haluros de hidrógeno ","H2SO4 0.1N"]
[null,null,null,null,null,null,null,"Halógenos","H2SO4 0.1N"]
[null,null,null,null,null,null,null,"HF","H2SO4 0.1N"]
[null,null,null,null,null,null,null,"HCl","H2SO4 0.1N"]
[null,null,null,null,null,null,null,"HBr","H2SO4 0.1N"]
[null,null,null,null,null,null,null,"Cl2","NaOH 0.1N"]
[null,null,null,null,null,null,null,"Br2","NaOH 0.1N"]
[null,null,null,null,null,null,null,"Arsénico (As)","F. GF 82.6 mm"]
[null,null,null,null,null,null,null,"Arsénico (As)","S.A. 5% HNO3/10% H2O2"]
[null,null,null,null,null,null,null,"Plomo (Pb)","F. GF 82.6 mm"]
[null,null,null,null,null,null,null,"Plomo (Pb)","S.A. 5% HNO3/10% H2O2"]
[null,null,null,null,null,null,null,"Cobre (Cu)","F. GF 82.6 mm"]
[null,null,null,null,null,null,null,"Cobre (Cu)","S.A. 5% HNO3/10% H2O2"]
[null,null,null,null,null,null,null,"Estaño (Sn)","F. GF 82.6 mm"]
[null,null,null,null,null,null,null,"Estaño (Sn)","S.A. 5% HNO3/10% H2O2"]
[null,null,null,null,null,null,null,"Cromo (Cr)","F. GF 82.6 mm"]
[null,null,null,null,null,null,null,"Cromo (Cr)","S.A. 5% HNO3/10% H2O2"]
[null,null,null,null,null,null,null,"Cobalto (Co)","F. GF 82.6 mm"]
[null,null,null,null,null,null,null,"Cobalto (Co)","S.A. 5% HNO3/10% H2O2"]
[null,null,null,null,null,null,null,"Manganeso (Mg)","F. GF 82.6 mm"]
[null,null,null,null,null,null,null,"Manganeso (Mg)","S.A. 5% HNO3/10% H2O2"]
[null,null,null,null,null,null,null,"Niquel (Ni)","F. GF 82.6 mm"]
[null,null,null,null,null,null,null,"Niquel (Ni)","S.A. 5% HNO3/10% H2O2"]
[null,null,null,null,null,null,null,"Vanadio (V)","F. GF 82.6 mm"]
[null,null,null,null,null,null,null,"Vanadio (V)","S.A. 5% HNO3/10% H2O2"]
[null,null,null,null,null,null,null,"Antimonio (Sb)","F. GF 82.6 mm"]
[null,null,null,null,null,null,null,"Antimonio (Sb)","S.A. 5% HNO3/10% H2O2"]
[null,null,null,null,null,null,null,"Mercurio (Hg)","S.A. 4% KMnO4/10% H2SO4"]
[null,null,null,null,null,null,null,"Mercurio (Hg)","F. GF 82.6 mm"]
[null,null,null,null,null,null,null,"Metales ","F. GF 82.6 mm"]
[null,null,null,null,null,null,null,"Metales ","S.A. 4% KMnO4/10% H2SO4"]
[null,null,null,null,null,null,null,"Amoniaco (NH3)","H2SO4 0.1N"]
[null,null,null,null,null,null,null,"PAH's","Otro"]
[null,null,null,null,null,null,null,"COV's","SKC 226-01"]
[null,null,null,null,null,null,null,"COV's","SKC 226-09"]
[null,null,null,null,null,null,null,"COV's","ZST-001"]
[null,null,null,null,null,null,null,"COV's","ZST-022"]
[null,null,null,null,null,null,null,"COV's","ORBO 32S"]
[null,null,null,null,null,null,null,"COV's","ORBO 32L"]
[null,null,null,null,null,null,null,"COV's","Otro"]
[null,null,null,null,null,null,null,"Otro","F. PTFE 46.2 mm"]
[null,null,null,null,null,null,null,"Otro","F. GF 47 mm"]
[null,null,null,null,null,null,null,"Otro","F. Cuarzo 47 mm"]
[null,null,null,null,null,null,null,"Otro","F. GF 82.6 mm"]
[null,null,null,null,null,null,null,"Otro","F. GF 203 mm x 254 mm"]
[null,null,null,null,null,null,null,"Otro","F. Cuarzo 203 mm x 254 mm"]
[null,null,null,null,null,null,null,"Otro","Acetona"]
[null,null,null,null,null,null,null,"Otro","S.A. IPA 80% - GFF"]
[null,null,null,null,null,null,null,"Otro","S.A. H2O2 3%"]
[null,null,null,null,null,null,null,"Otro","S.A. H2SO4-H2O2"]
[null,null,null,null,null,null,null,"Otro","S.A. 0.04M TCM"]
[null,null,null,null,null,null,null,"Otro","SKC 226-01"]
[null,null,null,null,null,null,null,"Otro","SKC 226-09"]
[null,null,null,null,null,null,null,"Otro","ZST-001"]
[null,null,null,null,null,null,null,"Otro","ZST-022"]
[null,null,null,null,null,null,null,"Otro","ORBO 32S"]
[null,null,null,null,null,null,null,"Otro","ORBO 32L"]
[null,null,null,null,null,null,null,"Otro","H2SO4 0.1N"]
[null,null,null,null,null,null,null,"Otro","NaOH 0.1N"]
[null,null,null,null,null,null,null,"Otro","S.A. 5% HNO3/10% H2O2"]
[null,null,null,null,null,null,null,"Otro","S.A. 4% KMnO4/10% H2SO4"]
[null,null,null,null,null,null,null,"Otro","Tolueno"]
[null,null,null,null,null,null,null,"Otro","Hexano"]
[null,null,null,null,null,null,null,"Otro","Resina"]
[null,null,null,null,null,null,null,"Otro","Otro"]
[null,null,null,null,null,null,null,"BTEX","Otro"]
[null,null,null,null,null,null,null,"HCT's como n-hexano","Otro"]
[null,null,null,null,null,null,null,"HCT's como metano","Otro"]