{"text_format":"1","workbook":"xlsx","n_sheets":7,"sheets":["COC","Informe","Gravimetría","Espectrofotometría","Titulación","Cromatografía gases","Descripcion"],"not_rendered":{"charts":0,"images":3,"macros":1,"external_links":0,"defined_names":153,"comments":2,"pivot_tables":0},"unopened":[],"bounds":{"document_bytes":16777216,"sheet_cells":100000,"rows_first":2000,"rows_last":500,"rows_between":2000,"halvings":0,"cell_chars":16384,"cell_head_chars":4096},"cells_cut":0,"cells_raw":0,"read":"whole","date_system":"1900"}

{"sheet":"COC","index":0,"n_rows":68,"n_cols":11,"rows_kept":68,"cut":false,"hidden":false,"merged":[[14,0,14,6],[15,1,15,6],[16,3,16,6],[17,5,17,6],[45,0,45,6],[51,1,51,6],[16,1,16,2],[19,0,20,0],[47,1,47,2],[48,1,48,2],[18,0,18,4],[18,5,18,6],[19,1,20,6],[22,0,22,6],[46,1,46,6],[47,4,47,6],[48,4,48,6],[50,0,50,6],[69,0,69,5],[70,0,70,5],[52,1,52,2],[56,0,56,5],[58,0,58,5],[59,0,59,5],[60,0,60,5],[63,0,63,5],[52,4,52,6],[53,5,53,6],[54,1,54,6],[64,0,64,6],[65,0,65,5],[66,0,66,5],[67,0,67,5],[68,0,68,5],[10,1,10,2],[11,1,11,2],[12,1,12,2],[11,3,12,3],[8,4,8,6],[10,4,10,6],[9,4,9,6],[11,4,12,6],[8,1,8,2],[9,1,9,2],[3,5,3,6],[5,0,5,2],[6,1,6,2],[7,1,7,2],[6,4,6,6],[7,4,7,6],[5,3,5,6]]}
[]
[]
[]
["Movimiento",null,"Custodia ",null,"Informe"]
[]
["Reportar a:",null,null,"Facturar a:"]
["*Responsable",null,null,"*Razón social"]
["Empresa/Organización",null,null,"*Correo de facturación"]
["Ciudad / País",null,null,"Ciudad / País"]
["Dirección",null,null,"Teléfono"]
["Teléfono",null,null,"Orden de servicio"]
["*Propuesta / OC",null,null,"Observaciones"]
["*Correo electrónico"]
[]
["Información del proyecto "]
["*Nombre del proyecto",null,null,null,null,null,null,null,"Opcion"]
["*Cantidad de muestras",{"$f":"+COUNTA(A25:A44)","v":0},null,null,null,null,null,null,null,2,true]
["*Tiempo de respuesta"]
["**Consultar previamente disponibilidad (tiempos en días hábiles)",null,null,null,null,"Firma de autorización recargo"]
["Instrucciones especiales",null,null,null,null,null,null,null,{"$error":"#REF!"},null,false]
[]
[]
["Información de las muestras"]
["*ID Laboratorio","*ID Cliente","*Fecha de muestreo","*Método","*Análisis","*Medio de retención","V(L)"]
[]
[]
[]
[]
[]
[]
[]
[]
[]
[]
[]
[]
[]
[]
[]
[]
[]
[]
[]
[]
[]
["Entregado por"]
["*Responsable"]
["*Fecha",null,null,"*Hora"]
["Método de envío",null,null,"Numero de guía"]
[]
["Recibido por"]
["Responsable"]
["Fecha",null,null,"Hora"]
["Temperatura (°C)",null,null,"Condiciones embalaje "]
["Observaciones generales"]
[]
["Nota: Muestras recibidas posterior a las 12:00 PM serán consideradas recepcionadas el siguiente día hábil."]
[]
["Convenciones: "]
["*Campos obligatorios"]
["Fecha: Fecha de muestreo (DD/MM/YYYY)"]
["V (L): Volumen de muestra en litros, para blancos diligenciar N.A."]
[]
["Consideraciones especiales:"]
["- El laboratorio no fue responsable del envío de las muestras ni de la integralidad de estas antes de ingresar a las instalaciones."]
[" - A menos de que sea notificado y este descrito en las observaciones, las muestras fueron recepcionadas en condiciones aceptables."]
["- El laboratorio no fue responsable de la etapa de muestreo y sus datos."]
["- Toda novedad en la recepción podrá provocar rechazos o retrasos en la entrega de resultados."]

{"sheet":"Informe","index":1,"n_rows":346,"n_cols":12,"rows_kept":346,"cut":false,"hidden":true,"merged":[[11,9,14,13],[11,8,14,8],[0,0,2,13]]}
["Formato de analisis IH"]
[]
[]
[null,"Proyecto: ",{"$f":"IF($L$11=0,\"\",COC!B16)","v":""}]
[null,"Empresa:",{"$f":"IF($L$11=0,\"\",COC!B8)","v":""}]
[null,"Solicitante: ",{"$f":"IF($L$11=0,\"\",COC!B7)","v":""}]
[null,"E-mail: ",{"$f":"IF($L$11=0,\"\",COC!B13)","v":""}]
[null,"Dirección: ",{"$f":"IF($L$11=0,\"\",COC!B10)","v":""}]
[null,"Teléfono:",{"$f":"IF($L$11=0,\"\",COC!B11)","v":""}]
[]
["Numero de muestra","*ID ","Consecutivo Custodia","*Fecha de muestreo","*Método","*Análisis","*Medio de retención","Volumen (L)","Fecha de recepcion",{"$f":"IF(L11=0,\"\",COC!B53)","v":""},"Custodia ",{"$f":"COC!D4","v":0}]
[null,{"$f":"CONCATENATE(COC!A25,\"-\",COC!B2)","v":"-"},{"$f":"IF(A12=0,\"\",_xlfn.CONCAT($L$11,\"-\",A12))","v":""},{"$f":"IF(A12=0,\"\",COC!C25)","v":""},{"$f":"IF(A12=0,\"\",COC!D25)","v":""},{"$f":"IF(A12=0,\"\",COC!E25)","v":""},{"$f":"IF(A12=0,\"\",COC!F25)","v":""},{"$f":"IF(A12=0,\"\",COC!G25)","v":""},"Observaciones",{"$f":"IF(AND(COC!B55=0,COC!B20=0),\"Sin observaciones\",_xlfn.CONCAT(COC!B20,\"-\",COC!B55))","v":"Sin observaciones"}]
[null,{"$f":"CONCATENATE(COC!A26,\"-\",COC!B3)","v":"-"},{"$f":"IF(A13=0,\"\",_xlfn.CONCAT($L$11,\"-\",A13))","v":""},{"$f":"IF(A13=0,\"\",COC!C26)","v":""},{"$f":"IF(A13=0,\"\",COC!D26)","v":""},{"$f":"IF(A13=0,\"\",COC!E26)","v":""},{"$f":"IF(A13=0,\"\",COC!F26)","v":""},{"$f":"IF(A13=0,\"\",COC!G26)","v":""}]
[null,{"$f":"CONCATENATE(COC!A27,\"-\",COC!B4)","v":"-"},"",{"$f":"IF(A14=0,\"\",COC!C27)","v":""},{"$f":"IF(A14=0,\"\",COC!D27)","v":""},{"$f":"IF(A14=0,\"\",COC!E27)","v":""},{"$f":"IF(A14=0,\"\",COC!F27)","v":""},{"$f":"IF(A14=0,\"\",COC!G27)","v":""}]
[null,{"$f":"CONCATENATE(COC!A28,\"-\",COC!B5)","v":"-"},"",{"$f":"IF(A15=0,\"\",COC!C28)","v":""},{"$f":"IF(A15=0,\"\",COC!D28)","v":""},{"$f":"IF(A15=0,\"\",COC!E28)","v":""},{"$f":"IF(A15=0,\"\",COC!F28)","v":""},{"$f":"IF(A15=0,\"\",COC!G28)","v":""}]
[null,{"$f":"CONCATENATE(COC!A29,\"-\",COC!B6)","v":"-"},"",{"$f":"IF(A16=0,\"\",COC!C29)","v":""},{"$f":"IF(A16=0,\"\",COC!D29)","v":""},{"$f":"IF(A16=0,\"\",COC!E29)","v":""},{"$f":"IF(A16=0,\"\",COC!F29)","v":""},{"$f":"IF(A16=0,\"\",COC!G29)","v":""}]
[null,{"$f":"CONCATENATE(COC!A30,\"-\",COC!B7)","v":"-"},"",{"$f":"IF(A17=0,\"\",COC!C30)","v":""},{"$f":"IF(A17=0,\"\",COC!D30)","v":""},{"$f":"IF(A17=0,\"\",COC!E30)","v":""},{"$f":"IF(A17=0,\"\",COC!F30)","v":""},{"$f":"IF(A17=0,\"\",COC!G30)","v":""}]
[null,{"$f":"CONCATENATE(COC!A31,\"-\",COC!B8)","v":"-"},"",{"$f":"IF(A18=0,\"\",COC!C31)","v":""},{"$f":"IF(A18=0,\"\",COC!D31)","v":""},{"$f":"IF(A18=0,\"\",COC!E31)","v":""},{"$f":"IF(A18=0,\"\",COC!F31)","v":""},{"$f":"IF(A18=0,\"\",COC!G31)","v":""}]
[null,{"$f":"CONCATENATE(COC!A32,\"-\",COC!B9)","v":"-"},"",{"$f":"IF(A19=0,\"\",COC!C32)","v":""},{"$f":"IF(A19=0,\"\",COC!D32)","v":""},{"$f":"IF(A19=0,\"\",COC!E32)","v":""},{"$f":"IF(A19=0,\"\",COC!F32)","v":""},{"$f":"IF(A19=0,\"\",COC!G32)","v":""}]
[null,{"$f":"CONCATENATE(COC!A33,\"-\",COC!B10)","v":"-"},"",{"$f":"IF(A20=0,\"\",COC!C33)","v":""},{"$f":"IF(A20=0,\"\",COC!D33)","v":""},{"$f":"IF(A20=0,\"\",COC!E33)","v":""},{"$f":"IF(A20=0,\"\",COC!F33)","v":""},{"$f":"IF(A20=0,\"\",COC!G33)","v":""}]
[null,{"$f":"CONCATENATE(COC!A34,\"-\",COC!B11)","v":"-"},"",{"$f":"IF(A21=0,\"\",COC!C34)","v":""},{"$f":"IF(A21=0,\"\",COC!D34)","v":""},{"$f":"IF(A21=0,\"\",COC!E34)","v":""},{"$f":"IF(A21=0,\"\",COC!F34)","v":""},{"$f":"IF(A21=0,\"\",COC!G34)","v":""}]
[null,{"$f":"CONCATENATE(COC!A35,\"-\",COC!B12)","v":"-"},"",{"$f":"IF(A22=0,\"\",COC!C35)","v":""},{"$f":"IF(A22=0,\"\",COC!D35)","v":""},{"$f":"IF(A22=0,\"\",COC!E35)","v":""},{"$f":"IF(A22=0,\"\",COC!F35)","v":""},{"$f":"IF(A22=0,\"\",COC!G35)","v":""}]
[null,{"$f":"CONCATENATE(COC!A36,\"-\",COC!B13)","v":"-"},"",{"$f":"IF(A23=0,\"\",COC!C36)","v":""},{"$f":"IF(A23=0,\"\",COC!D36)","v":""},{"$f":"IF(A23=0,\"\",COC!E36)","v":""},{"$f":"IF(A23=0,\"\",COC!F36)","v":""},{"$f":"IF(A23=0,\"\",COC!G36)","v":""}]
[null,{"$f":"CONCATENATE(COC!A37,\"-\",COC!B14)","v":"-"},"",{"$f":"IF(A24=0,\"\",COC!C37)","v":""},{"$f":"IF(A24=0,\"\",COC!D37)","v":""},{"$f":"IF(A24=0,\"\",COC!E37)","v":""},{"$f":"IF(A24=0,\"\",COC!F37)","v":""},{"$f":"IF(A24=0,\"\",COC!G37)","v":""}]
[null,{"$f":"CONCATENATE(COC!A38,\"-\",COC!B15)","v":"-"},"",{"$f":"IF(A25=0,\"\",COC!C38)","v":""},{"$f":"IF(A25=0,\"\",COC!D38)","v":""},{"$f":"IF(A25=0,\"\",COC!E38)","v":""},{"$f":"IF(A25=0,\"\",COC!F38)","v":""},{"$f":"IF(A25=0,\"\",COC!G38)","v":""}]
[null,{"$f":"CONCATENATE(COC!A39,\"-\",COC!B16)","v":"-"},"",{"$f":"IF(A26=0,\"\",COC!C39)","v":""},{"$f":"IF(A26=0,\"\",COC!D39)","v":""},{"$f":"IF(A26=0,\"\",COC!E39)","v":""},{"$f":"IF(A26=0,\"\",COC!F39)","v":""},{"$f":"IF(A26=0,\"\",COC!G39)","v":""}]
[null,{"$f":"CONCATENATE(COC!A40,\"-\",COC!B17)","v":"-0"},"",{"$f":"IF(A27=0,\"\",COC!C40)","v":""},{"$f":"IF(A27=0,\"\",COC!D40)","v":""},{"$f":"IF(A27=0,\"\",COC!E40)","v":""},{"$f":"IF(A27=0,\"\",COC!F40)","v":""},{"$f":"IF(A27=0,\"\",COC!G40)","v":""}]
[null,{"$f":"CONCATENATE(COC!A41,\"-\",COC!B18)","v":"-"},"",{"$f":"IF(A28=0,\"\",COC!C41)","v":""},{"$f":"IF(A28=0,\"\",COC!D41)","v":""},{"$f":"IF(A28=0,\"\",COC!E41)","v":""},{"$f":"IF(A28=0,\"\",COC!F41)","v":""},{"$f":"IF(A28=0,\"\",COC!G41)","v":""}]
[null,{"$f":"CONCATENATE(COC!A42,\"-\",COC!B19)","v":"-"},"",{"$f":"IF(A29=0,\"\",COC!C42)","v":""},{"$f":"IF(A29=0,\"\",COC!D42)","v":""},{"$f":"IF(A29=0,\"\",COC!E42)","v":""},{"$f":"IF(A29=0,\"\",COC!F42)","v":""},{"$f":"IF(A29=0,\"\",COC!G42)","v":""}]
[null,{"$f":"CONCATENATE(COC!A43,\"-\",COC!B20)","v":"-"},"",{"$f":"IF(A30=0,\"\",COC!C43)","v":""},{"$f":"IF(A30=0,\"\",COC!D43)","v":""},{"$f":"IF(A30=0,\"\",COC!E43)","v":""},{"$f":"IF(A30=0,\"\",COC!F43)","v":""},{"$f":"IF(A30=0,\"\",COC!G43)","v":""}]
[null,{"$f":"CONCATENATE(COC!A44,\"-\",COC!B21)","v":"-"},"",{"$f":"IF(A31=0,\"\",COC!C44)","v":""},{"$f":"IF(A31=0,\"\",COC!D44)","v":""},{"$f":"IF(A31=0,\"\",COC!E44)","v":""},{"$f":"IF(A31=0,\"\",COC!F44)","v":""},{"$f":"IF(A31=0,\"\",COC!G44)","v":""}]
[null,{"$f":"CONCATENATE(COC!A45,\"-\",COC!B22)","v":"-"},"",{"$f":"IF(A32=0,\"\",COC!C45)","v":""},{"$f":"IF(A32=0,\"\",COC!D45)","v":""},{"$f":"IF(A32=0,\"\",COC!E45)","v":""},{"$f":"IF(A32=0,\"\",COC!F45)","v":""},{"$f":"IF(A32=0,\"\",COC!G45)","v":""}]
[null,{"$f":"CONCATENATE(COC!A46,\"-\",COC!B23)","v":"Entregado por-"},"",{"$f":"IF(A33=0,\"\",COC!C46)","v":""},{"$f":"IF(A33=0,\"\",COC!D46)","v":""},{"$f":"IF(A33=0,\"\",COC!E46)","v":""},{"$f":"IF(A33=0,\"\",COC!F46)","v":""},{"$f":"IF(A33=0,\"\",COC!G46)","v":""}]
[null,{"$f":"CONCATENATE(COC!A47,\"-\",COC!B24)","v":"*Responsable-*ID Cliente"},"",{"$f":"IF(A34=0,\"\",COC!C47)","v":""},{"$f":"IF(A34=0,\"\",COC!D47)","v":""},{"$f":"IF(A34=0,\"\",COC!E47)","v":""},{"$f":"IF(A34=0,\"\",COC!F47)","v":""},{"$f":"IF(A34=0,\"\",COC!G47)","v":""}]
[null,{"$f":"CONCATENATE(COC!A48,\"-\",COC!B25)","v":"*Fecha-"},"",{"$f":"IF(A35=0,\"\",COC!C48)","v":""},{"$f":"IF(A35=0,\"\",COC!D48)","v":""},{"$f":"IF(A35=0,\"\",COC!E48)","v":""},{"$f":"IF(A35=0,\"\",COC!F48)","v":""},{"$f":"IF(A35=0,\"\",COC!G48)","v":""}]
[null,{"$f":"CONCATENATE(COC!A49,\"-\",COC!B26)","v":"Método de envío-"},"",{"$f":"IF(A36=0,\"\",COC!C49)","v":""},{"$f":"IF(A36=0,\"\",COC!D49)","v":""},{"$f":"IF(A36=0,\"\",COC!E49)","v":""},{"$f":"IF(A36=0,\"\",COC!F49)","v":""},{"$f":"IF(A36=0,\"\",COC!G49)","v":""}]
[null,{"$f":"CONCATENATE(COC!A50,\"-\",COC!B27)","v":"-"},"",{"$f":"IF(A37=0,\"\",COC!C50)","v":""},{"$f":"IF(A37=0,\"\",COC!D50)","v":""},{"$f":"IF(A37=0,\"\",COC!E50)","v":""},{"$f":"IF(A37=0,\"\",COC!F50)","v":""},{"$f":"IF(A37=0,\"\",COC!G50)","v":""}]
[null,{"$f":"CONCATENATE(COC!A51,\"-\",COC!B28)","v":"Recibido por-"},"",{"$f":"IF(A38=0,\"\",COC!C51)","v":""},{"$f":"IF(A38=0,\"\",COC!D51)","v":""},{"$f":"IF(A38=0,\"\",COC!E51)","v":""},{"$f":"IF(A38=0,\"\",COC!F51)","v":""},{"$f":"IF(A38=0,\"\",COC!G51)","v":""}]
[null,{"$f":"CONCATENATE(COC!A52,\"-\",COC!B29)","v":"Responsable-"},"",{"$f":"IF(A39=0,\"\",COC!C52)","v":""},{"$f":"IF(A39=0,\"\",COC!D52)","v":""},{"$f":"IF(A39=0,\"\",COC!E52)","v":""},{"$f":"IF(A39=0,\"\",COC!F52)","v":""},{"$f":"IF(A39=0,\"\",COC!G52)","v":""}]
[null,{"$f":"CONCATENATE(COC!A53,\"-\",COC!B30)","v":"Fecha-"},"",{"$f":"IF(A40=0,\"\",COC!C53)","v":""},{"$f":"IF(A40=0,\"\",COC!D53)","v":""},{"$f":"IF(A40=0,\"\",COC!E53)","v":""},{"$f":"IF(A40=0,\"\",COC!F53)","v":""},{"$f":"IF(A40=0,\"\",COC!G53)","v":""}]
[null,{"$f":"CONCATENATE(COC!A54,\"-\",COC!B31)","v":"Temperatura (°C)-"},"",{"$f":"IF(A41=0,\"\",COC!C54)","v":""},{"$f":"IF(A41=0,\"\",COC!D54)","v":""},{"$f":"IF(A41=0,\"\",COC!E54)","v":""},{"$f":"IF(A41=0,\"\",COC!F54)","v":""},{"$f":"IF(A41=0,\"\",COC!G54)","v":""}]
[null,{"$f":"CONCATENATE(COC!A55,\"-\",COC!B32)","v":"Observaciones generales-"},"",{"$f":"IF(A42=0,\"\",COC!C55)","v":""},{"$f":"IF(A42=0,\"\",COC!D55)","v":""},{"$f":"IF(A42=0,\"\",COC!E55)","v":""},{"$f":"IF(A42=0,\"\",COC!F55)","v":""},{"$f":"IF(A42=0,\"\",COC!G55)","v":""}]
[null,{"$f":"CONCATENATE(COC!A56,\"-\",COC!B33)","v":"-"},"",{"$f":"IF(A43=0,\"\",COC!C56)","v":""},{"$f":"IF(A43=0,\"\",COC!D56)","v":""},{"$f":"IF(A43=0,\"\",COC!E56)","v":""},{"$f":"IF(A43=0,\"\",COC!F56)","v":""},{"$f":"IF(A43=0,\"\",COC!G56)","v":""}]
[null,{"$f":"CONCATENATE(COC!A57,\"-\",COC!B34)","v":"Nota: Muestras recibidas posterior a las 12:00 PM serán consideradas recepcionadas el siguiente día hábil.-"},"",{"$f":"IF(A44=0,\"\",COC!C57)","v":""},{"$f":"IF(A44=0,\"\",COC!D57)","v":""},{"$f":"IF(A44=0,\"\",COC!E57)","v":""},{"$f":"IF(A44=0,\"\",COC!F57)","v":""},{"$f":"IF(A44=0,\"\",COC!G57)","v":""}]
[null,{"$f":"CONCATENATE(COC!A58,\"-\",COC!B35)","v":"-"},"",{"$f":"IF(A45=0,\"\",COC!C58)","v":""},{"$f":"IF(A45=0,\"\",COC!D58)","v":""},{"$f":"IF(A45=0,\"\",COC!E58)","v":""},{"$f":"IF(A45=0,\"\",COC!F58)","v":""},{"$f":"IF(A45=0,\"\",COC!G58)","v":""}]
[null,{"$f":"CONCATENATE(COC!A59,\"-\",COC!B36)","v":"Convenciones: -"},"",{"$f":"IF(A46=0,\"\",COC!C59)","v":""},{"$f":"IF(A46=0,\"\",COC!D59)","v":""},{"$f":"IF(A46=0,\"\",COC!E59)","v":""},{"$f":"IF(A46=0,\"\",COC!F59)","v":""},{"$f":"IF(A46=0,\"\",COC!G59)","v":""}]
[null,{"$f":"CONCATENATE(COC!A60,\"-\",COC!B37)","v":"*Campos obligatorios-"},"",{"$f":"IF(A47=0,\"\",COC!C60)","v":""},{"$f":"IF(A47=0,\"\",COC!D60)","v":""},{"$f":"IF(A47=0,\"\",COC!E60)","v":""},{"$f":"IF(A47=0,\"\",COC!F60)","v":""},{"$f":"IF(A47=0,\"\",COC!G60)","v":""}]
[null,{"$f":"CONCATENATE(COC!A61,\"-\",COC!B38)","v":"Fecha: Fecha de muestreo (DD/MM/YYYY)-"},"",{"$f":"IF(A48=0,\"\",COC!C61)","v":""},{"$f":"IF(A48=0,\"\",COC!D61)","v":""},{"$f":"IF(A48=0,\"\",COC!E61)","v":""},{"$f":"IF(A48=0,\"\",COC!F61)","v":""},{"$f":"IF(A48=0,\"\",COC!G61)","v":""}]
[null,{"$f":"CONCATENATE(COC!A62,\"-\",COC!B39)","v":"V (L): Volumen de muestra en litros, para blancos diligenciar N.A.-"},"",{"$f":"IF(A49=0,\"\",COC!C62)","v":""},{"$f":"IF(A49=0,\"\",COC!D62)","v":""},{"$f":"IF(A49=0,\"\",COC!E62)","v":""},{"$f":"IF(A49=0,\"\",COC!F62)","v":""},{"$f":"IF(A49=0,\"\",COC!G62)","v":""}]
[null,{"$f":"CONCATENATE(COC!A63,\"-\",COC!B40)","v":"-"},"",{"$f":"IF(A50=0,\"\",COC!C63)","v":""},{"$f":"IF(A50=0,\"\",COC!D63)","v":""},{"$f":"IF(A50=0,\"\",COC!E63)","v":""},{"$f":"IF(A50=0,\"\",COC!F63)","v":""},{"$f":"IF(A50=0,\"\",COC!G63)","v":""}]
[null,{"$f":"CONCATENATE(COC!A64,\"-\",COC!B41)","v":"Consideraciones especiales:-"},"",{"$f":"IF(A51=0,\"\",COC!C64)","v":""},{"$f":"IF(A51=0,\"\",COC!D64)","v":""},{"$f":"IF(A51=0,\"\",COC!E64)","v":""},{"$f":"IF(A51=0,\"\",COC!F64)","v":""},{"$f":"IF(A51=0,\"\",COC!G64)","v":""}]
[null,{"$f":"CONCATENATE(COC!A65,\"-\",COC!B42)","v":"- El laboratorio no fue responsable del envío de las muestras ni de la integralidad de estas antes de ingresar a las instalaciones.-"},"",{"$f":"IF(A52=0,\"\",COC!C65)","v":""},{"$f":"IF(A52=0,\"\",COC!D65)","v":""},{"$f":"IF(A52=0,\"\",COC!E65)","v":""},{"$f":"IF(A52=0,\"\",COC!F65)","v":""},{"$f":"IF(A52=0,\"\",COC!G65)","v":""}]
[null,{"$f":"CONCATENATE(COC!A66,\"-\",COC!B43)","v":" - A menos de que sea notificado y este descrito en las observaciones, las muestras fueron recepcionadas en condiciones aceptables.-"},"",{"$f":"IF(A53=0,\"\",COC!C66)","v":""},{"$f":"IF(A53=0,\"\",COC!D66)","v":""},{"$f":"IF(A53=0,\"\",COC!E66)","v":""},{"$f":"IF(A53=0,\"\",COC!F66)","v":""},{"$f":"IF(A53=0,\"\",COC!G66)","v":""}]
[null,{"$f":"CONCATENATE(COC!A67,\"-\",COC!B44)","v":"- El laboratorio no fue responsable de la etapa de muestreo y sus datos.-"},"",{"$f":"IF(A54=0,\"\",COC!C67)","v":""},{"$f":"IF(A54=0,\"\",COC!D67)","v":""},{"$f":"IF(A54=0,\"\",COC!E67)","v":""},{"$f":"IF(A54=0,\"\",COC!F67)","v":""},{"$f":"IF(A54=0,\"\",COC!G67)","v":""}]
[null,{"$f":"CONCATENATE(COC!A68,\"-\",COC!B45)","v":"- Toda novedad en la recepción podrá provocar rechazos o retrasos en la entrega de resultados.-"},"",{"$f":"IF(A55=0,\"\",COC!C68)","v":""},{"$f":"IF(A55=0,\"\",COC!D68)","v":""},{"$f":"IF(A55=0,\"\",COC!E68)","v":""},{"$f":"IF(A55=0,\"\",COC!F68)","v":""},{"$f":"IF(A55=0,\"\",COC!G68)","v":""}]
[null,{"$f":"CONCATENATE(COC!A69,\"-\",COC!B46)","v":"-"},"",{"$f":"IF(A56=0,\"\",COC!C69)","v":""},{"$f":"IF(A56=0,\"\",COC!D69)","v":""},{"$f":"IF(A56=0,\"\",COC!E69)","v":""},{"$f":"IF(A56=0,\"\",COC!F69)","v":""},{"$f":"IF(A56=0,\"\",COC!G69)","v":""}]
[null,{"$f":"CONCATENATE(COC!A70,\"-\",COC!B47)","v":"-"},"",{"$f":"IF(A57=0,\"\",COC!C70)","v":""},{"$f":"IF(A57=0,\"\",COC!D70)","v":""},{"$f":"IF(A57=0,\"\",COC!E70)","v":""},{"$f":"IF(A57=0,\"\",COC!F70)","v":""},{"$f":"IF(A57=0,\"\",COC!G70)","v":""}]
[null,{"$f":"CONCATENATE(COC!A71,\"-\",COC!B48)","v":"-"},"",{"$f":"IF(A58=0,\"\",COC!C71)","v":""},{"$f":"IF(A58=0,\"\",COC!D71)","v":""},{"$f":"IF(A58=0,\"\",COC!E71)","v":""},{"$f":"IF(A58=0,\"\",COC!F71)","v":""},{"$f":"IF(A58=0,\"\",COC!G71)","v":""}]
[null,{"$f":"CONCATENATE(COC!A72,\"-\",COC!B49)","v":"-"},"",{"$f":"IF(A59=0,\"\",COC!C72)","v":""},{"$f":"IF(A59=0,\"\",COC!D72)","v":""},{"$f":"IF(A59=0,\"\",COC!E72)","v":""},{"$f":"IF(A59=0,\"\",COC!F72)","v":""},{"$f":"IF(A59=0,\"\",COC!G72)","v":""}]
[null,{"$f":"CONCATENATE(COC!A73,\"-\",COC!B50)","v":"-"},"",{"$f":"IF(A60=0,\"\",COC!C73)","v":""},{"$f":"IF(A60=0,\"\",COC!D73)","v":""},{"$f":"IF(A60=0,\"\",COC!E73)","v":""},{"$f":"IF(A60=0,\"\",COC!F73)","v":""},{"$f":"IF(A60=0,\"\",COC!G73)","v":""}]
[null,{"$f":"CONCATENATE(COC!A74,\"-\",COC!B51)","v":"-"},"",{"$f":"IF(A61=0,\"\",COC!C74)","v":""},{"$f":"IF(A61=0,\"\",COC!D74)","v":""},{"$f":"IF(A61=0,\"\",COC!E74)","v":""},{"$f":"IF(A61=0,\"\",COC!F74)","v":""},{"$f":"IF(A61=0,\"\",COC!G74)","v":""}]
[null,{"$f":"CONCATENATE(COC!A75,\"-\",COC!B52)","v":"-"},"",{"$f":"IF(A62=0,\"\",COC!C75)","v":""},{"$f":"IF(A62=0,\"\",COC!D75)","v":""},{"$f":"IF(A62=0,\"\",COC!E75)","v":""},{"$f":"IF(A62=0,\"\",COC!F75)","v":""},{"$f":"IF(A62=0,\"\",COC!G75)","v":""}]
[null,{"$f":"CONCATENATE(COC!A76,\"-\",COC!B53)","v":"-"},"",{"$f":"IF(A63=0,\"\",COC!C76)","v":""},{"$f":"IF(A63=0,\"\",COC!D76)","v":""},{"$f":"IF(A63=0,\"\",COC!E76)","v":""},{"$f":"IF(A63=0,\"\",COC!F76)","v":""},{"$f":"IF(A63=0,\"\",COC!G76)","v":""}]
[null,{"$f":"CONCATENATE(COC!A77,\"-\",COC!B54)","v":"-"},"",{"$f":"IF(A64=0,\"\",COC!C77)","v":""},{"$f":"IF(A64=0,\"\",COC!D77)","v":""},{"$f":"IF(A64=0,\"\",COC!E77)","v":""},{"$f":"IF(A64=0,\"\",COC!F77)","v":""},{"$f":"IF(A64=0,\"\",COC!G77)","v":""}]
[null,{"$f":"CONCATENATE(COC!A78,\"-\",COC!B55)","v":"-"},"",{"$f":"IF(A65=0,\"\",COC!C78)","v":""},{"$f":"IF(A65=0,\"\",COC!D78)","v":""},{"$f":"IF(A65=0,\"\",COC!E78)","v":""},{"$f":"IF(A65=0,\"\",COC!F78)","v":""},{"$f":"IF(A65=0,\"\",COC!G78)","v":""}]
[null,{"$f":"CONCATENATE(COC!A79,\"-\",COC!B56)","v":"-"},"",{"$f":"IF(A66=0,\"\",COC!C79)","v":""},{"$f":"IF(A66=0,\"\",COC!D79)","v":""},{"$f":"IF(A66=0,\"\",COC!E79)","v":""},{"$f":"IF(A66=0,\"\",COC!F79)","v":""},{"$f":"IF(A66=0,\"\",COC!G79)","v":""}]
[null,{"$f":"CONCATENATE(COC!A80,\"-\",COC!B57)","v":"-"},"",{"$f":"IF(A67=0,\"\",COC!C80)","v":""},{"$f":"IF(A67=0,\"\",COC!D80)","v":""},{"$f":"IF(A67=0,\"\",COC!E80)","v":""},{"$f":"IF(A67=0,\"\",COC!F80)","v":""},{"$f":"IF(A67=0,\"\",COC!G80)","v":""}]
[null,{"$f":"CONCATENATE(COC!A81,\"-\",COC!B58)","v":"-"},"",{"$f":"IF(A68=0,\"\",COC!C81)","v":""},{"$f":"IF(A68=0,\"\",COC!D81)","v":""},{"$f":"IF(A68=0,\"\",COC!E81)","v":""},{"$f":"IF(A68=0,\"\",COC!F81)","v":""},{"$f":"IF(A68=0,\"\",COC!G81)","v":""}]
[null,{"$f":"CONCATENATE(COC!A82,\"-\",COC!B59)","v":"-"},"",{"$f":"IF(A69=0,\"\",COC!C82)","v":""},{"$f":"IF(A69=0,\"\",COC!D82)","v":""},{"$f":"IF(A69=0,\"\",COC!E82)","v":""},{"$f":"IF(A69=0,\"\",COC!F82)","v":""},{"$f":"IF(A69=0,\"\",COC!G82)","v":""}]
[null,{"$f":"CONCATENATE(COC!A83,\"-\",COC!B60)","v":"-"},"",{"$f":"IF(A70=0,\"\",COC!C83)","v":""},{"$f":"IF(A70=0,\"\",COC!D83)","v":""},{"$f":"IF(A70=0,\"\",COC!E83)","v":""},{"$f":"IF(A70=0,\"\",COC!F83)","v":""},{"$f":"IF(A70=0,\"\",COC!G83)","v":""}]
[null,{"$f":"CONCATENATE(COC!A84,\"-\",COC!B61)","v":"-"},"",{"$f":"IF(A71=0,\"\",COC!C84)","v":""},{"$f":"IF(A71=0,\"\",COC!D84)","v":""},{"$f":"IF(A71=0,\"\",COC!E84)","v":""},{"$f":"IF(A71=0,\"\",COC!F84)","v":""},{"$f":"IF(A71=0,\"\",COC!G84)","v":""}]
[null,{"$f":"CONCATENATE(COC!A85,\"-\",COC!B62)","v":"-"},"",{"$f":"IF(A72=0,\"\",COC!C85)","v":""},{"$f":"IF(A72=0,\"\",COC!D85)","v":""},{"$f":"IF(A72=0,\"\",COC!E85)","v":""},{"$f":"IF(A72=0,\"\",COC!F85)","v":""},{"$f":"IF(A72=0,\"\",COC!G85)","v":""}]
[null,{"$f":"CONCATENATE(COC!A86,\"-\",COC!B63)","v":"-"},"",{"$f":"IF(A73=0,\"\",COC!C86)","v":""},{"$f":"IF(A73=0,\"\",COC!D86)","v":""},{"$f":"IF(A73=0,\"\",COC!E86)","v":""},{"$f":"IF(A73=0,\"\",COC!F86)","v":""},{"$f":"IF(A73=0,\"\",COC!G86)","v":""}]
[null,{"$f":"CONCATENATE(COC!A87,\"-\",COC!B64)","v":"-"},"",{"$f":"IF(A74=0,\"\",COC!C87)","v":""},{"$f":"IF(A74=0,\"\",COC!D87)","v":""},{"$f":"IF(A74=0,\"\",COC!E87)","v":""},{"$f":"IF(A74=0,\"\",COC!F87)","v":""},{"$f":"IF(A74=0,\"\",COC!G87)","v":""}]
[null,{"$f":"CONCATENATE(COC!A88,\"-\",COC!B65)","v":"-"},"",{"$f":"IF(A75=0,\"\",COC!C88)","v":""},{"$f":"IF(A75=0,\"\",COC!D88)","v":""},{"$f":"IF(A75=0,\"\",COC!E88)","v":""},{"$f":"IF(A75=0,\"\",COC!F88)","v":""},{"$f":"IF(A75=0,\"\",COC!G88)","v":""}]
[null,{"$f":"CONCATENATE(COC!A89,\"-\",COC!B66)","v":"-"},"",{"$f":"IF(A76=0,\"\",COC!C89)","v":""},{"$f":"IF(A76=0,\"\",COC!D89)","v":""},{"$f":"IF(A76=0,\"\",COC!E89)","v":""},{"$f":"IF(A76=0,\"\",COC!F89)","v":""},{"$f":"IF(A76=0,\"\",COC!G89)","v":""}]
[null,{"$f":"CONCATENATE(COC!A90,\"-\",COC!B67)","v":"-"},{"$f":"IF(A77=0,\"\",_xlfn.CONCAT($L$11,\"-\",A77))","v":""},{"$f":"IF(A77=0,\"\",COC!C90)","v":""},{"$f":"IF(A77=0,\"\",COC!D90)","v":""},{"$f":"IF(A77=0,\"\",COC!E90)","v":""},{"$f":"IF(A77=0,\"\",COC!F90)","v":""},{"$f":"IF(A77=0,\"\",COC!G90)","v":""}]
[null,{"$f":"CONCATENATE(COC!A91,\"-\",COC!B68)","v":"-"},"",{"$f":"IF(A78=0,\"\",COC!C91)","v":""},{"$f":"IF(A78=0,\"\",COC!D91)","v":""},{"$f":"IF(A78=0,\"\",COC!E91)","v":""},{"$f":"IF(A78=0,\"\",COC!F91)","v":""},{"$f":"IF(A78=0,\"\",COC!G91)","v":""}]
[null,{"$f":"CONCATENATE(COC!A92,\"-\",COC!B69)","v":"-"},"",{"$f":"IF(A79=0,\"\",COC!C92)","v":""},{"$f":"IF(A79=0,\"\",COC!D92)","v":""},{"$f":"IF(A79=0,\"\",COC!E92)","v":""},{"$f":"IF(A79=0,\"\",COC!F92)","v":""},{"$f":"IF(A79=0,\"\",COC!G92)","v":""}]
[null,{"$f":"CONCATENATE(COC!A93,\"-\",COC!B70)","v":"-"},"",{"$f":"IF(A80=0,\"\",COC!C93)","v":""},{"$f":"IF(A80=0,\"\",COC!D93)","v":""},{"$f":"IF(A80=0,\"\",COC!E93)","v":""},{"$f":"IF(A80=0,\"\",COC!F93)","v":""},{"$f":"IF(A80=0,\"\",COC!G93)","v":""}]
[null,{"$f":"CONCATENATE(COC!A94,\"-\",COC!B71)","v":"-"},"",{"$f":"IF(A81=0,\"\",COC!C94)","v":""},{"$f":"IF(A81=0,\"\",COC!D94)","v":""},{"$f":"IF(A81=0,\"\",COC!E94)","v":""},{"$f":"IF(A81=0,\"\",COC!F94)","v":""},{"$f":"IF(A81=0,\"\",COC!G94)","v":""}]
[null,{"$f":"CONCATENATE(COC!A95,\"-\",COC!B72)","v":"-"},"",{"$f":"IF(A82=0,\"\",COC!C95)","v":""},{"$f":"IF(A82=0,\"\",COC!D95)","v":""},{"$f":"IF(A82=0,\"\",COC!E95)","v":""},{"$f":"IF(A82=0,\"\",COC!F95)","v":""},{"$f":"IF(A82=0,\"\",COC!G95)","v":""}]
[null,{"$f":"CONCATENATE(COC!A96,\"-\",COC!B73)","v":"-"},"",{"$f":"IF(A83=0,\"\",COC!C96)","v":""},{"$f":"IF(A83=0,\"\",COC!D96)","v":""},{"$f":"IF(A83=0,\"\",COC!E96)","v":""},{"$f":"IF(A83=0,\"\",COC!F96)","v":""},{"$f":"IF(A83=0,\"\",COC!G96)","v":""}]
[null,{"$f":"CONCATENATE(COC!A97,\"-\",COC!B74)","v":"-"},"",{"$f":"IF(A84=0,\"\",COC!C97)","v":""},{"$f":"IF(A84=0,\"\",COC!D97)","v":""},{"$f":"IF(A84=0,\"\",COC!E97)","v":""},{"$f":"IF(A84=0,\"\",COC!F97)","v":""},{"$f":"IF(A84=0,\"\",COC!G97)","v":""}]
[null,{"$f":"CONCATENATE(COC!A98,\"-\",COC!B75)","v":"-"},"",{"$f":"IF(A85=0,\"\",COC!C98)","v":""},{"$f":"IF(A85=0,\"\",COC!D98)","v":""},{"$f":"IF(A85=0,\"\",COC!E98)","v":""},{"$f":"IF(A85=0,\"\",COC!F98)","v":""},{"$f":"IF(A85=0,\"\",COC!G98)","v":""}]
[null,{"$f":"CONCATENATE(COC!A99,\"-\",COC!B76)","v":"-"},"",{"$f":"IF(A86=0,\"\",COC!C99)","v":""},{"$f":"IF(A86=0,\"\",COC!D99)","v":""},{"$f":"IF(A86=0,\"\",COC!E99)","v":""},{"$f":"IF(A86=0,\"\",COC!F99)","v":""},{"$f":"IF(A86=0,\"\",COC!G99)","v":""}]
[null,{"$f":"CONCATENATE(COC!A100,\"-\",COC!B77)","v":"-"},"",{"$f":"IF(A87=0,\"\",COC!C100)","v":""},{"$f":"IF(A87=0,\"\",COC!D100)","v":""},{"$f":"IF(A87=0,\"\",COC!E100)","v":""},{"$f":"IF(A87=0,\"\",COC!F100)","v":""},{"$f":"IF(A87=0,\"\",COC!G100)","v":""}]
[null,{"$f":"CONCATENATE(COC!A101,\"-\",COC!B78)","v":"-"},"",{"$f":"IF(A88=0,\"\",COC!C101)","v":""},{"$f":"IF(A88=0,\"\",COC!D101)","v":""},{"$f":"IF(A88=0,\"\",COC!E101)","v":""},{"$f":"IF(A88=0,\"\",COC!F101)","v":""},{"$f":"IF(A88=0,\"\",COC!G101)","v":""}]
[null,{"$f":"CONCATENATE(COC!A102,\"-\",COC!B79)","v":"-"},"",{"$f":"IF(A89=0,\"\",COC!C102)","v":""},{"$f":"IF(A89=0,\"\",COC!D102)","v":""},{"$f":"IF(A89=0,\"\",COC!E102)","v":""},{"$f":"IF(A89=0,\"\",COC!F102)","v":""},{"$f":"IF(A89=0,\"\",COC!G102)","v":""}]
[null,{"$f":"CONCATENATE(COC!A103,\"-\",COC!B80)","v":"-"},"",{"$f":"IF(A90=0,\"\",COC!C103)","v":""},{"$f":"IF(A90=0,\"\",COC!D103)","v":""},{"$f":"IF(A90=0,\"\",COC!E103)","v":""},{"$f":"IF(A90=0,\"\",COC!F103)","v":""},{"$f":"IF(A90=0,\"\",COC!G103)","v":""}]
[null,{"$f":"CONCATENATE(COC!A104,\"-\",COC!B81)","v":"-"},"",{"$f":"IF(A91=0,\"\",COC!C104)","v":""},{"$f":"IF(A91=0,\"\",COC!D104)","v":""},{"$f":"IF(A91=0,\"\",COC!E104)","v":""},{"$f":"IF(A91=0,\"\",COC!F104)","v":""},{"$f":"IF(A91=0,\"\",COC!G104)","v":""}]
[null,{"$f":"CONCATENATE(COC!A105,\"-\",COC!B82)","v":"-"},"",{"$f":"IF(A92=0,\"\",COC!C105)","v":""},{"$f":"IF(A92=0,\"\",COC!D105)","v":""},{"$f":"IF(A92=0,\"\",COC!E105)","v":""},{"$f":"IF(A92=0,\"\",COC!F105)","v":""},{"$f":"IF(A92=0,\"\",COC!G105)","v":""}]
[null,{"$f":"CONCATENATE(COC!A106,\"-\",COC!B83)","v":"-"},"",{"$f":"IF(A93=0,\"\",COC!C106)","v":""},{"$f":"IF(A93=0,\"\",COC!D106)","v":""},{"$f":"IF(A93=0,\"\",COC!E106)","v":""},{"$f":"IF(A93=0,\"\",COC!F106)","v":""},{"$f":"IF(A93=0,\"\",COC!G106)","v":""}]
[null,{"$f":"CONCATENATE(COC!A107,\"-\",COC!B84)","v":"-"},"",{"$f":"IF(A94=0,\"\",COC!C107)","v":""},{"$f":"IF(A94=0,\"\",COC!D107)","v":""},{"$f":"IF(A94=0,\"\",COC!E107)","v":""},{"$f":"IF(A94=0,\"\",COC!F107)","v":""},{"$f":"IF(A94=0,\"\",COC!G107)","v":""}]
[null,{"$f":"CONCATENATE(COC!A108,\"-\",COC!B85)","v":"-"},"",{"$f":"IF(A95=0,\"\",COC!C108)","v":""},{"$f":"IF(A95=0,\"\",COC!D108)","v":""},{"$f":"IF(A95=0,\"\",COC!E108)","v":""},{"$f":"IF(A95=0,\"\",COC!F108)","v":""},{"$f":"IF(A95=0,\"\",COC!G108)","v":""}]
[null,{"$f":"CONCATENATE(COC!A109,\"-\",COC!B86)","v":"-"},"",{"$f":"IF(A96=0,\"\",COC!C109)","v":""},{"$f":"IF(A96=0,\"\",COC!D109)","v":""},{"$f":"IF(A96=0,\"\",COC!E109)","v":""},{"$f":"IF(A96=0,\"\",COC!F109)","v":""},{"$f":"IF(A96=0,\"\",COC!G109)","v":""}]
[null,{"$f":"CONCATENATE(COC!A110,\"-\",COC!B87)","v":"-"},"",{"$f":"IF(A97=0,\"\",COC!C110)","v":""},{"$f":"IF(A97=0,\"\",COC!D110)","v":""},{"$f":"IF(A97=0,\"\",COC!E110)","v":""},{"$f":"IF(A97=0,\"\",COC!F110)","v":""},{"$f":"IF(A97=0,\"\",COC!G110)","v":""}]
[null,{"$f":"CONCATENATE(COC!A111,\"-\",COC!B88)","v":"-"},"",{"$f":"IF(A98=0,\"\",COC!C111)","v":""},{"$f":"IF(A98=0,\"\",COC!D111)","v":""},{"$f":"IF(A98=0,\"\",COC!E111)","v":""},{"$f":"IF(A98=0,\"\",COC!F111)","v":""},{"$f":"IF(A98=0,\"\",COC!G111)","v":""}]
[null,{"$f":"CONCATENATE(COC!A112,\"-\",COC!B89)","v":"-"},"",{"$f":"IF(A99=0,\"\",COC!C112)","v":""},{"$f":"IF(A99=0,\"\",COC!D112)","v":""},{"$f":"IF(A99=0,\"\",COC!E112)","v":""},{"$f":"IF(A99=0,\"\",COC!F112)","v":""},{"$f":"IF(A99=0,\"\",COC!G112)","v":""}]
[null,{"$f":"CONCATENATE(COC!A113,\"-\",COC!B90)","v":"-"},"",{"$f":"IF(A100=0,\"\",COC!C113)","v":""},{"$f":"IF(A100=0,\"\",COC!D113)","v":""},{"$f":"IF(A100=0,\"\",COC!E113)","v":""},{"$f":"IF(A100=0,\"\",COC!F113)","v":""},{"$f":"IF(A100=0,\"\",COC!G113)","v":""}]
[null,{"$f":"CONCATENATE(COC!A114,\"-\",COC!B91)","v":"-"},"",{"$f":"IF(A101=0,\"\",COC!C114)","v":""},{"$f":"IF(A101=0,\"\",COC!D114)","v":""},{"$f":"IF(A101=0,\"\",COC!E114)","v":""},{"$f":"IF(A101=0,\"\",COC!F114)","v":""},{"$f":"IF(A101=0,\"\",COC!G114)","v":""}]
[null,{"$f":"CONCATENATE(COC!A115,\"-\",COC!B92)","v":"-"},"",{"$f":"IF(A102=0,\"\",COC!C115)","v":""},{"$f":"IF(A102=0,\"\",COC!D115)","v":""},{"$f":"IF(A102=0,\"\",COC!E115)","v":""},{"$f":"IF(A102=0,\"\",COC!F115)","v":""},{"$f":"IF(A102=0,\"\",COC!G115)","v":""}]
[null,{"$f":"CONCATENATE(COC!A116,\"-\",COC!B93)","v":"-"},"",{"$f":"IF(A103=0,\"\",COC!C116)","v":""},{"$f":"IF(A103=0,\"\",COC!D116)","v":""},{"$f":"IF(A103=0,\"\",COC!E116)","v":""},{"$f":"IF(A103=0,\"\",COC!F116)","v":""},{"$f":"IF(A103=0,\"\",COC!G116)","v":""}]
[null,{"$f":"CONCATENATE(COC!A117,\"-\",COC!B94)","v":"-"},"",{"$f":"IF(A104=0,\"\",COC!C117)","v":""},{"$f":"IF(A104=0,\"\",COC!D117)","v":""},{"$f":"IF(A104=0,\"\",COC!E117)","v":""},{"$f":"IF(A104=0,\"\",COC!F117)","v":""},{"$f":"IF(A104=0,\"\",COC!G117)","v":""}]
[null,{"$f":"CONCATENATE(COC!A118,\"-\",COC!B95)","v":"-"},"",{"$f":"IF(A105=0,\"\",COC!C118)","v":""},{"$f":"IF(A105=0,\"\",COC!D118)","v":""},{"$f":"IF(A105=0,\"\",COC!E118)","v":""},{"$f":"IF(A105=0,\"\",COC!F118)","v":""},{"$f":"IF(A105=0,\"\",COC!G118)","v":""}]
[null,{"$f":"CONCATENATE(COC!A119,\"-\",COC!B96)","v":"-"},"",{"$f":"IF(A106=0,\"\",COC!C119)","v":""},{"$f":"IF(A106=0,\"\",COC!D119)","v":""},{"$f":"IF(A106=0,\"\",COC!E119)","v":""},{"$f":"IF(A106=0,\"\",COC!F119)","v":""},{"$f":"IF(A106=0,\"\",COC!G119)","v":""}]
[null,{"$f":"CONCATENATE(COC!A120,\"-\",COC!B97)","v":"-"},"",{"$f":"IF(A107=0,\"\",COC!C120)","v":""},{"$f":"IF(A107=0,\"\",COC!D120)","v":""},{"$f":"IF(A107=0,\"\",COC!E120)","v":""},{"$f":"IF(A107=0,\"\",COC!F120)","v":""},{"$f":"IF(A107=0,\"\",COC!G120)","v":""}]
[null,{"$f":"CONCATENATE(COC!A121,\"-\",COC!B98)","v":"-"},"",{"$f":"IF(A108=0,\"\",COC!C121)","v":""},{"$f":"IF(A108=0,\"\",COC!D121)","v":""},{"$f":"IF(A108=0,\"\",COC!E121)","v":""},{"$f":"IF(A108=0,\"\",COC!F121)","v":""},{"$f":"IF(A108=0,\"\",COC!G121)","v":""}]
[null,{"$f":"CONCATENATE(COC!A122,\"-\",COC!B99)","v":"-"},"",{"$f":"IF(A109=0,\"\",COC!C122)","v":""},{"$f":"IF(A109=0,\"\",COC!D122)","v":""},{"$f":"IF(A109=0,\"\",COC!E122)","v":""},{"$f":"IF(A109=0,\"\",COC!F122)","v":""},{"$f":"IF(A109=0,\"\",COC!G122)","v":""}]
[null,{"$f":"CONCATENATE(COC!A123,\"-\",COC!B100)","v":"-"},"",{"$f":"IF(A110=0,\"\",COC!C123)","v":""},{"$f":"IF(A110=0,\"\",COC!D123)","v":""},{"$f":"IF(A110=0,\"\",COC!E123)","v":""},{"$f":"IF(A110=0,\"\",COC!F123)","v":""},{"$f":"IF(A110=0,\"\",COC!G123)","v":""}]
[null,{"$f":"CONCATENATE(COC!A124,\"-\",COC!B101)","v":"-"},"",{"$f":"IF(A111=0,\"\",COC!C124)","v":""},{"$f":"IF(A111=0,\"\",COC!D124)","v":""},{"$f":"IF(A111=0,\"\",COC!E124)","v":""},{"$f":"IF(A111=0,\"\",COC!F124)","v":""},{"$f":"IF(A111=0,\"\",COC!G124)","v":""}]
[null,{"$f":"CONCATENATE(COC!A125,\"-\",COC!B102)","v":"-"},"",{"$f":"IF(A112=0,\"\",COC!C125)","v":""},{"$f":"IF(A112=0,\"\",COC!D125)","v":""},{"$f":"IF(A112=0,\"\",COC!E125)","v":""},{"$f":"IF(A112=0,\"\",COC!F125)","v":""},{"$f":"IF(A112=0,\"\",COC!G125)","v":""}]
[null,{"$f":"CONCATENATE(COC!A126,\"-\",COC!B103)","v":"-"},"",{"$f":"IF(A113=0,\"\",COC!C126)","v":""},{"$f":"IF(A113=0,\"\",COC!D126)","v":""},{"$f":"IF(A113=0,\"\",COC!E126)","v":""},{"$f":"IF(A113=0,\"\",COC!F126)","v":""},{"$f":"IF(A113=0,\"\",COC!G126)","v":""}]
[null,{"$f":"CONCATENATE(COC!A127,\"-\",COC!B104)","v":"-"},"",{"$f":"IF(A114=0,\"\",COC!C127)","v":""},{"$f":"IF(A114=0,\"\",COC!D127)","v":""},{"$f":"IF(A114=0,\"\",COC!E127)","v":""},{"$f":"IF(A114=0,\"\",COC!F127)","v":""},{"$f":"IF(A114=0,\"\",COC!G127)","v":""}]
[null,{"$f":"CONCATENATE(COC!A128,\"-\",COC!B105)","v":"-"},"",{"$f":"IF(A115=0,\"\",COC!C128)","v":""},{"$f":"IF(A115=0,\"\",COC!D128)","v":""},{"$f":"IF(A115=0,\"\",COC!E128)","v":""},{"$f":"IF(A115=0,\"\",COC!F128)","v":""},{"$f":"IF(A115=0,\"\",COC!G128)","v":""}]
[null,{"$f":"CONCATENATE(COC!A129,\"-\",COC!B106)","v":"-"},"",{"$f":"IF(A116=0,\"\",COC!C129)","v":""},{"$f":"IF(A116=0,\"\",COC!D129)","v":""},{"$f":"IF(A116=0,\"\",COC!E129)","v":""},{"$f":"IF(A116=0,\"\",COC!F129)","v":""},{"$f":"IF(A116=0,\"\",COC!G129)","v":""}]
[null,{"$f":"CONCATENATE(COC!A130,\"-\",COC!B107)","v":"-"},"",{"$f":"IF(A117=0,\"\",COC!C130)","v":""},{"$f":"IF(A117=0,\"\",COC!D130)","v":""},{"$f":"IF(A117=0,\"\",COC!E130)","v":""},{"$f":"IF(A117=0,\"\",COC!F130)","v":""},{"$f":"IF(A117=0,\"\",COC!G130)","v":""}]
[null,{"$f":"CONCATENATE(COC!A131,\"-\",COC!B108)","v":"-"},"",{"$f":"IF(A118=0,\"\",COC!C131)","v":""},{"$f":"IF(A118=0,\"\",COC!D131)","v":""},{"$f":"IF(A118=0,\"\",COC!E131)","v":""},{"$f":"IF(A118=0,\"\",COC!F131)","v":""},{"$f":"IF(A118=0,\"\",COC!G131)","v":""}]
[null,{"$f":"CONCATENATE(COC!A132,\"-\",COC!B109)","v":"-"},"",{"$f":"IF(A119=0,\"\",COC!C132)","v":""},{"$f":"IF(A119=0,\"\",COC!D132)","v":""},{"$f":"IF(A119=0,\"\",COC!E132)","v":""},{"$f":"IF(A119=0,\"\",COC!F132)","v":""},{"$f":"IF(A119=0,\"\",COC!G132)","v":""}]
[null,{"$f":"CONCATENATE(COC!A133,\"-\",COC!B110)","v":"-"},"",{"$f":"IF(A120=0,\"\",COC!C133)","v":""},{"$f":"IF(A120=0,\"\",COC!D133)","v":""},{"$f":"IF(A120=0,\"\",COC!E133)","v":""},{"$f":"IF(A120=0,\"\",COC!F133)","v":""},{"$f":"IF(A120=0,\"\",COC!G133)","v":""}]
[null,{"$f":"CONCATENATE(COC!A134,\"-\",COC!B111)","v":"-"},"",{"$f":"IF(A121=0,\"\",COC!C134)","v":""},{"$f":"IF(A121=0,\"\",COC!D134)","v":""},{"$f":"IF(A121=0,\"\",COC!E134)","v":""},{"$f":"IF(A121=0,\"\",COC!F134)","v":""},{"$f":"IF(A121=0,\"\",COC!G134)","v":""}]
[null,{"$f":"CONCATENATE(COC!A135,\"-\",COC!B112)","v":"-"},"",{"$f":"IF(A122=0,\"\",COC!C135)","v":""},{"$f":"IF(A122=0,\"\",COC!D135)","v":""},{"$f":"IF(A122=0,\"\",COC!E135)","v":""},{"$f":"IF(A122=0,\"\",COC!F135)","v":""},{"$f":"IF(A122=0,\"\",COC!G135)","v":""}]
[null,{"$f":"CONCATENATE(COC!A136,\"-\",COC!B113)","v":"-"},"",{"$f":"IF(A123=0,\"\",COC!C136)","v":""},{"$f":"IF(A123=0,\"\",COC!D136)","v":""},{"$f":"IF(A123=0,\"\",COC!E136)","v":""},{"$f":"IF(A123=0,\"\",COC!F136)","v":""},{"$f":"IF(A123=0,\"\",COC!G136)","v":""}]
[null,{"$f":"CONCATENATE(COC!A137,\"-\",COC!B114)","v":"-"},"",{"$f":"IF(A124=0,\"\",COC!C137)","v":""},{"$f":"IF(A124=0,\"\",COC!D137)","v":""},{"$f":"IF(A124=0,\"\",COC!E137)","v":""},{"$f":"IF(A124=0,\"\",COC!F137)","v":""},{"$f":"IF(A124=0,\"\",COC!G137)","v":""}]
[null,{"$f":"CONCATENATE(COC!A138,\"-\",COC!B115)","v":"-"},"",{"$f":"IF(A125=0,\"\",COC!C138)","v":""},{"$f":"IF(A125=0,\"\",COC!D138)","v":""},{"$f":"IF(A125=0,\"\",COC!E138)","v":""},{"$f":"IF(A125=0,\"\",COC!F138)","v":""},{"$f":"IF(A125=0,\"\",COC!G138)","v":""}]
[null,{"$f":"CONCATENATE(COC!A139,\"-\",COC!B116)","v":"-"},"",{"$f":"IF(A126=0,\"\",COC!C139)","v":""},{"$f":"IF(A126=0,\"\",COC!D139)","v":""},{"$f":"IF(A126=0,\"\",COC!E139)","v":""},{"$f":"IF(A126=0,\"\",COC!F139)","v":""},{"$f":"IF(A126=0,\"\",COC!G139)","v":""}]
[null,{"$f":"CONCATENATE(COC!A140,\"-\",COC!B117)","v":"-"},"",{"$f":"IF(A127=0,\"\",COC!C140)","v":""},{"$f":"IF(A127=0,\"\",COC!D140)","v":""},{"$f":"IF(A127=0,\"\",COC!E140)","v":""},{"$f":"IF(A127=0,\"\",COC!F140)","v":""},{"$f":"IF(A127=0,\"\",COC!G140)","v":""}]
[null,{"$f":"CONCATENATE(COC!A141,\"-\",COC!B118)","v":"-"},"",{"$f":"IF(A128=0,\"\",COC!C141)","v":""},{"$f":"IF(A128=0,\"\",COC!D141)","v":""},{"$f":"IF(A128=0,\"\",COC!E141)","v":""},{"$f":"IF(A128=0,\"\",COC!F141)","v":""},{"$f":"IF(A128=0,\"\",COC!G141)","v":""}]
[null,{"$f":"CONCATENATE(COC!A142,\"-\",COC!B119)","v":"-"},"",{"$f":"IF(A129=0,\"\",COC!C142)","v":""},{"$f":"IF(A129=0,\"\",COC!D142)","v":""},{"$f":"IF(A129=0,\"\",COC!E142)","v":""},{"$f":"IF(A129=0,\"\",COC!F142)","v":""},{"$f":"IF(A129=0,\"\",COC!G142)","v":""}]
[null,{"$f":"CONCATENATE(COC!A143,\"-\",COC!B120)","v":"-"},"",{"$f":"IF(A130=0,\"\",COC!C143)","v":""},{"$f":"IF(A130=0,\"\",COC!D143)","v":""},{"$f":"IF(A130=0,\"\",COC!E143)","v":""},{"$f":"IF(A130=0,\"\",COC!F143)","v":""},{"$f":"IF(A130=0,\"\",COC!G143)","v":""}]
[null,{"$f":"CONCATENATE(COC!A144,\"-\",COC!B121)","v":"-"},"",{"$f":"IF(A131=0,\"\",COC!C144)","v":""},{"$f":"IF(A131=0,\"\",COC!D144)","v":""},{"$f":"IF(A131=0,\"\",COC!E144)","v":""},{"$f":"IF(A131=0,\"\",COC!F144)","v":""},{"$f":"IF(A131=0,\"\",COC!G144)","v":""}]
[null,{"$f":"CONCATENATE(COC!A145,\"-\",COC!B122)","v":"-"},"",{"$f":"IF(A132=0,\"\",COC!C145)","v":""},{"$f":"IF(A132=0,\"\",COC!D145)","v":""},{"$f":"IF(A132=0,\"\",COC!E145)","v":""},{"$f":"IF(A132=0,\"\",COC!F145)","v":""},{"$f":"IF(A132=0,\"\",COC!G145)","v":""}]
[null,{"$f":"CONCATENATE(COC!A146,\"-\",COC!B123)","v":"-"},"",{"$f":"IF(A133=0,\"\",COC!C146)","v":""},{"$f":"IF(A133=0,\"\",COC!D146)","v":""},{"$f":"IF(A133=0,\"\",COC!E146)","v":""},{"$f":"IF(A133=0,\"\",COC!F146)","v":""},{"$f":"IF(A133=0,\"\",COC!G146)","v":""}]
[null,{"$f":"CONCATENATE(COC!A147,\"-\",COC!B124)","v":"-"},"",{"$f":"IF(A134=0,\"\",COC!C147)","v":""},{"$f":"IF(A134=0,\"\",COC!D147)","v":""},{"$f":"IF(A134=0,\"\",COC!E147)","v":""},{"$f":"IF(A134=0,\"\",COC!F147)","v":""},{"$f":"IF(A134=0,\"\",COC!G147)","v":""}]
[null,{"$f":"CONCATENATE(COC!A148,\"-\",COC!B125)","v":"-"},"",{"$f":"IF(A135=0,\"\",COC!C148)","v":""},{"$f":"IF(A135=0,\"\",COC!D148)","v":""},{"$f":"IF(A135=0,\"\",COC!E148)","v":""},{"$f":"IF(A135=0,\"\",COC!F148)","v":""},{"$f":"IF(A135=0,\"\",COC!G148)","v":""}]
[null,{"$f":"CONCATENATE(COC!A149,\"-\",COC!B126)","v":"-"},"",{"$f":"IF(A136=0,\"\",COC!C149)","v":""},{"$f":"IF(A136=0,\"\",COC!D149)","v":""},{"$f":"IF(A136=0,\"\",COC!E149)","v":""},{"$f":"IF(A136=0,\"\",COC!F149)","v":""},{"$f":"IF(A136=0,\"\",COC!G149)","v":""}]
[null,{"$f":"CONCATENATE(COC!A150,\"-\",COC!B127)","v":"-"},"",{"$f":"IF(A137=0,\"\",COC!C150)","v":""},{"$f":"IF(A137=0,\"\",COC!D150)","v":""},{"$f":"IF(A137=0,\"\",COC!E150)","v":""},{"$f":"IF(A137=0,\"\",COC!F150)","v":""},{"$f":"IF(A137=0,\"\",COC!G150)","v":""}]
[null,{"$f":"CONCATENATE(COC!A151,\"-\",COC!B128)","v":"-"},"",{"$f":"IF(A138=0,\"\",COC!C151)","v":""},{"$f":"IF(A138=0,\"\",COC!D151)","v":""},{"$f":"IF(A138=0,\"\",COC!E151)","v":""},{"$f":"IF(A138=0,\"\",COC!F151)","v":""},{"$f":"IF(A138=0,\"\",COC!G151)","v":""}]
[null,{"$f":"CONCATENATE(COC!A152,\"-\",COC!B129)","v":"-"},"",{"$f":"IF(A139=0,\"\",COC!C152)","v":""},{"$f":"IF(A139=0,\"\",COC!D152)","v":""},{"$f":"IF(A139=0,\"\",COC!E152)","v":""},{"$f":"IF(A139=0,\"\",COC!F152)","v":""},{"$f":"IF(A139=0,\"\",COC!G152)","v":""}]
[null,{"$f":"CONCATENATE(COC!A153,\"-\",COC!B130)","v":"-"},"",{"$f":"IF(A140=0,\"\",COC!C153)","v":""},{"$f":"IF(A140=0,\"\",COC!D153)","v":""},{"$f":"IF(A140=0,\"\",COC!E153)","v":""},{"$f":"IF(A140=0,\"\",COC!F153)","v":""},{"$f":"IF(A140=0,\"\",COC!G153)","v":""}]
[null,{"$f":"CONCATENATE(COC!A154,\"-\",COC!B131)","v":"-"},{"$f":"IF(A141=0,\"\",_xlfn.CONCAT($L$11,\"-\",A141))","v":""},{"$f":"IF(A141=0,\"\",COC!C154)","v":""},{"$f":"IF(A141=0,\"\",COC!D154)","v":""},{"$f":"IF(A141=0,\"\",COC!E154)","v":""},{"$f":"IF(A141=0,\"\",COC!F154)","v":""},{"$f":"IF(A141=0,\"\",COC!G154)","v":""}]
[null,{"$f":"CONCATENATE(COC!A155,\"-\",COC!B132)","v":"-"},"",{"$f":"IF(A142=0,\"\",COC!C155)","v":""},{"$f":"IF(A142=0,\"\",COC!D155)","v":""},{"$f":"IF(A142=0,\"\",COC!E155)","v":""},{"$f":"IF(A142=0,\"\",COC!F155)","v":""},{"$f":"IF(A142=0,\"\",COC!G155)","v":""}]
[null,{"$f":"CONCATENATE(COC!A156,\"-\",COC!B133)","v":"-"},"",{"$f":"IF(A143=0,\"\",COC!C156)","v":""},{"$f":"IF(A143=0,\"\",COC!D156)","v":""},{"$f":"IF(A143=0,\"\",COC!E156)","v":""},{"$f":"IF(A143=0,\"\",COC!F156)","v":""},{"$f":"IF(A143=0,\"\",COC!G156)","v":""}]
[null,{"$f":"CONCATENATE(COC!A157,\"-\",COC!B134)","v":"-"},"",{"$f":"IF(A144=0,\"\",COC!C157)","v":""},{"$f":"IF(A144=0,\"\",COC!D157)","v":""},{"$f":"IF(A144=0,\"\",COC!E157)","v":""},{"$f":"IF(A144=0,\"\",COC!F157)","v":""},{"$f":"IF(A144=0,\"\",COC!G157)","v":""}]
[null,{"$f":"CONCATENATE(COC!A158,\"-\",COC!B135)","v":"-"},"",{"$f":"IF(A145=0,\"\",COC!C158)","v":""},{"$f":"IF(A145=0,\"\",COC!D158)","v":""},{"$f":"IF(A145=0,\"\",COC!E158)","v":""},{"$f":"IF(A145=0,\"\",COC!F158)","v":""},{"$f":"IF(A145=0,\"\",COC!G158)","v":""}]
[null,{"$f":"CONCATENATE(COC!A159,\"-\",COC!B136)","v":"-"},"",{"$f":"IF(A146=0,\"\",COC!C159)","v":""},{"$f":"IF(A146=0,\"\",COC!D159)","v":""},{"$f":"IF(A146=0,\"\",COC!E159)","v":""},{"$f":"IF(A146=0,\"\",COC!F159)","v":""},{"$f":"IF(A146=0,\"\",COC!G159)","v":""}]
[null,{"$f":"CONCATENATE(COC!A160,\"-\",COC!B137)","v":"-"},"",{"$f":"IF(A147=0,\"\",COC!C160)","v":""},{"$f":"IF(A147=0,\"\",COC!D160)","v":""},{"$f":"IF(A147=0,\"\",COC!E160)","v":""},{"$f":"IF(A147=0,\"\",COC!F160)","v":""},{"$f":"IF(A147=0,\"\",COC!G160)","v":""}]
[null,{"$f":"CONCATENATE(COC!A161,\"-\",COC!B138)","v":"-"},"",{"$f":"IF(A148=0,\"\",COC!C161)","v":""},{"$f":"IF(A148=0,\"\",COC!D161)","v":""},{"$f":"IF(A148=0,\"\",COC!E161)","v":""},{"$f":"IF(A148=0,\"\",COC!F161)","v":""},{"$f":"IF(A148=0,\"\",COC!G161)","v":""}]
[null,{"$f":"CONCATENATE(COC!A162,\"-\",COC!B139)","v":"-"},"",{"$f":"IF(A149=0,\"\",COC!C162)","v":""},{"$f":"IF(A149=0,\"\",COC!D162)","v":""},{"$f":"IF(A149=0,\"\",COC!E162)","v":""},{"$f":"IF(A149=0,\"\",COC!F162)","v":""},{"$f":"IF(A149=0,\"\",COC!G162)","v":""}]
[null,{"$f":"CONCATENATE(COC!A163,\"-\",COC!B140)","v":"-"},"",{"$f":"IF(A150=0,\"\",COC!C163)","v":""},{"$f":"IF(A150=0,\"\",COC!D163)","v":""},{"$f":"IF(A150=0,\"\",COC!E163)","v":""},{"$f":"IF(A150=0,\"\",COC!F163)","v":""},{"$f":"IF(A150=0,\"\",COC!G163)","v":""}]
[null,{"$f":"CONCATENATE(COC!A164,\"-\",COC!B141)","v":"-"},"",{"$f":"IF(A151=0,\"\",COC!C164)","v":""},{"$f":"IF(A151=0,\"\",COC!D164)","v":""},{"$f":"IF(A151=0,\"\",COC!E164)","v":""},{"$f":"IF(A151=0,\"\",COC!F164)","v":""},{"$f":"IF(A151=0,\"\",COC!G164)","v":""}]
[null,{"$f":"CONCATENATE(COC!A165,\"-\",COC!B142)","v":"-"},"",{"$f":"IF(A152=0,\"\",COC!C165)","v":""},{"$f":"IF(A152=0,\"\",COC!D165)","v":""},{"$f":"IF(A152=0,\"\",COC!E165)","v":""},{"$f":"IF(A152=0,\"\",COC!F165)","v":""},{"$f":"IF(A152=0,\"\",COC!G165)","v":""}]
[null,{"$f":"CONCATENATE(COC!A166,\"-\",COC!B143)","v":"-"},"",{"$f":"IF(A153=0,\"\",COC!C166)","v":""},{"$f":"IF(A153=0,\"\",COC!D166)","v":""},{"$f":"IF(A153=0,\"\",COC!E166)","v":""},{"$f":"IF(A153=0,\"\",COC!F166)","v":""},{"$f":"IF(A153=0,\"\",COC!G166)","v":""}]
[null,{"$f":"CONCATENATE(COC!A167,\"-\",COC!B144)","v":"-"},"",{"$f":"IF(A154=0,\"\",COC!C167)","v":""},{"$f":"IF(A154=0,\"\",COC!D167)","v":""},{"$f":"IF(A154=0,\"\",COC!E167)","v":""},{"$f":"IF(A154=0,\"\",COC!F167)","v":""},{"$f":"IF(A154=0,\"\",COC!G167)","v":""}]
[null,{"$f":"CONCATENATE(COC!A168,\"-\",COC!B145)","v":"-"},"",{"$f":"IF(A155=0,\"\",COC!C168)","v":""},{"$f":"IF(A155=0,\"\",COC!D168)","v":""},{"$f":"IF(A155=0,\"\",COC!E168)","v":""},{"$f":"IF(A155=0,\"\",COC!F168)","v":""},{"$f":"IF(A155=0,\"\",COC!G168)","v":""}]
[null,{"$f":"CONCATENATE(COC!A169,\"-\",COC!B146)","v":"-"},"",{"$f":"IF(A156=0,\"\",COC!C169)","v":""},{"$f":"IF(A156=0,\"\",COC!D169)","v":""},{"$f":"IF(A156=0,\"\",COC!E169)","v":""},{"$f":"IF(A156=0,\"\",COC!F169)","v":""},{"$f":"IF(A156=0,\"\",COC!G169)","v":""}]
[null,{"$f":"CONCATENATE(COC!A170,\"-\",COC!B147)","v":"-"},"",{"$f":"IF(A157=0,\"\",COC!C170)","v":""},{"$f":"IF(A157=0,\"\",COC!D170)","v":""},{"$f":"IF(A157=0,\"\",COC!E170)","v":""},{"$f":"IF(A157=0,\"\",COC!F170)","v":""},{"$f":"IF(A157=0,\"\",COC!G170)","v":""}]
[null,{"$f":"CONCATENATE(COC!A171,\"-\",COC!B148)","v":"-"},"",{"$f":"IF(A158=0,\"\",COC!C171)","v":""},{"$f":"IF(A158=0,\"\",COC!D171)","v":""},{"$f":"IF(A158=0,\"\",COC!E171)","v":""},{"$f":"IF(A158=0,\"\",COC!F171)","v":""},{"$f":"IF(A158=0,\"\",COC!G171)","v":""}]
[null,{"$f":"CONCATENATE(COC!A172,\"-\",COC!B149)","v":"-"},"",{"$f":"IF(A159=0,\"\",COC!C172)","v":""},{"$f":"IF(A159=0,\"\",COC!D172)","v":""},{"$f":"IF(A159=0,\"\",COC!E172)","v":""},{"$f":"IF(A159=0,\"\",COC!F172)","v":""},{"$f":"IF(A159=0,\"\",COC!G172)","v":""}]
[null,{"$f":"CONCATENATE(COC!A173,\"-\",COC!B150)","v":"-"},"",{"$f":"IF(A160=0,\"\",COC!C173)","v":""},{"$f":"IF(A160=0,\"\",COC!D173)","v":""},{"$f":"IF(A160=0,\"\",COC!E173)","v":""},{"$f":"IF(A160=0,\"\",COC!F173)","v":""},{"$f":"IF(A160=0,\"\",COC!G173)","v":""}]
[null,{"$f":"CONCATENATE(COC!A174,\"-\",COC!B151)","v":"-"},"",{"$f":"IF(A161=0,\"\",COC!C174)","v":""},{"$f":"IF(A161=0,\"\",COC!D174)","v":""},{"$f":"IF(A161=0,\"\",COC!E174)","v":""},{"$f":"IF(A161=0,\"\",COC!F174)","v":""},{"$f":"IF(A161=0,\"\",COC!G174)","v":""}]
[null,{"$f":"CONCATENATE(COC!A175,\"-\",COC!B152)","v":"-"},"",{"$f":"IF(A162=0,\"\",COC!C175)","v":""},{"$f":"IF(A162=0,\"\",COC!D175)","v":""},{"$f":"IF(A162=0,\"\",COC!E175)","v":""},{"$f":"IF(A162=0,\"\",COC!F175)","v":""},{"$f":"IF(A162=0,\"\",COC!G175)","v":""}]
[null,{"$f":"CONCATENATE(COC!A176,\"-\",COC!B153)","v":"-"},"",{"$f":"IF(A163=0,\"\",COC!C176)","v":""},{"$f":"IF(A163=0,\"\",COC!D176)","v":""},{"$f":"IF(A163=0,\"\",COC!E176)","v":""},{"$f":"IF(A163=0,\"\",COC!F176)","v":""},{"$f":"IF(A163=0,\"\",COC!G176)","v":""}]
[null,{"$f":"CONCATENATE(COC!A177,\"-\",COC!B154)","v":"-"},"",{"$f":"IF(A164=0,\"\",COC!C177)","v":""},{"$f":"IF(A164=0,\"\",COC!D177)","v":""},{"$f":"IF(A164=0,\"\",COC!E177)","v":""},{"$f":"IF(A164=0,\"\",COC!F177)","v":""},{"$f":"IF(A164=0,\"\",COC!G177)","v":""}]
[null,{"$f":"CONCATENATE(COC!A178,\"-\",COC!B155)","v":"-"},"",{"$f":"IF(A165=0,\"\",COC!C178)","v":""},{"$f":"IF(A165=0,\"\",COC!D178)","v":""},{"$f":"IF(A165=0,\"\",COC!E178)","v":""},{"$f":"IF(A165=0,\"\",COC!F178)","v":""},{"$f":"IF(A165=0,\"\",COC!G178)","v":""}]
[null,{"$f":"CONCATENATE(COC!A179,\"-\",COC!B156)","v":"-"},"",{"$f":"IF(A166=0,\"\",COC!C179)","v":""},{"$f":"IF(A166=0,\"\",COC!D179)","v":""},{"$f":"IF(A166=0,\"\",COC!E179)","v":""},{"$f":"IF(A166=0,\"\",COC!F179)","v":""},{"$f":"IF(A166=0,\"\",COC!G179)","v":""}]
[null,{"$f":"CONCATENATE(COC!A180,\"-\",COC!B157)","v":"-"},"",{"$f":"IF(A167=0,\"\",COC!C180)","v":""},{"$f":"IF(A167=0,\"\",COC!D180)","v":""},{"$f":"IF(A167=0,\"\",COC!E180)","v":""},{"$f":"IF(A167=0,\"\",COC!F180)","v":""},{"$f":"IF(A167=0,\"\",COC!G180)","v":""}]
[null,{"$f":"CONCATENATE(COC!A181,\"-\",COC!B158)","v":"-"},"",{"$f":"IF(A168=0,\"\",COC!C181)","v":""},{"$f":"IF(A168=0,\"\",COC!D181)","v":""},{"$f":"IF(A168=0,\"\",COC!E181)","v":""},{"$f":"IF(A168=0,\"\",COC!F181)","v":""},{"$f":"IF(A168=0,\"\",COC!G181)","v":""}]
[null,{"$f":"CONCATENATE(COC!A182,\"-\",COC!B159)","v":"-"},"",{"$f":"IF(A169=0,\"\",COC!C182)","v":""},{"$f":"IF(A169=0,\"\",COC!D182)","v":""},{"$f":"IF(A169=0,\"\",COC!E182)","v":""},{"$f":"IF(A169=0,\"\",COC!F182)","v":""},{"$f":"IF(A169=0,\"\",COC!G182)","v":""}]
[null,{"$f":"CONCATENATE(COC!A183,\"-\",COC!B160)","v":"-"},"",{"$f":"IF(A170=0,\"\",COC!C183)","v":""},{"$f":"IF(A170=0,\"\",COC!D183)","v":""},{"$f":"IF(A170=0,\"\",COC!E183)","v":""},{"$f":"IF(A170=0,\"\",COC!F183)","v":""},{"$f":"IF(A170=0,\"\",COC!G183)","v":""}]
[null,{"$f":"CONCATENATE(COC!A184,\"-\",COC!B161)","v":"-"},"",{"$f":"IF(A171=0,\"\",COC!C184)","v":""},{"$f":"IF(A171=0,\"\",COC!D184)","v":""},{"$f":"IF(A171=0,\"\",COC!E184)","v":""},{"$f":"IF(A171=0,\"\",COC!F184)","v":""},{"$f":"IF(A171=0,\"\",COC!G184)","v":""}]
[null,{"$f":"CONCATENATE(COC!A185,\"-\",COC!B162)","v":"-"},"",{"$f":"IF(A172=0,\"\",COC!C185)","v":""},{"$f":"IF(A172=0,\"\",COC!D185)","v":""},{"$f":"IF(A172=0,\"\",COC!E185)","v":""},{"$f":"IF(A172=0,\"\",COC!F185)","v":""},{"$f":"IF(A172=0,\"\",COC!G185)","v":""}]
[null,{"$f":"CONCATENATE(COC!A186,\"-\",COC!B163)","v":"-"},"",{"$f":"IF(A173=0,\"\",COC!C186)","v":""},{"$f":"IF(A173=0,\"\",COC!D186)","v":""},{"$f":"IF(A173=0,\"\",COC!E186)","v":""},{"$f":"IF(A173=0,\"\",COC!F186)","v":""},{"$f":"IF(A173=0,\"\",COC!G186)","v":""}]
[null,{"$f":"CONCATENATE(COC!A187,\"-\",COC!B164)","v":"-"},"",{"$f":"IF(A174=0,\"\",COC!C187)","v":""},{"$f":"IF(A174=0,\"\",COC!D187)","v":""},{"$f":"IF(A174=0,\"\",COC!E187)","v":""},{"$f":"IF(A174=0,\"\",COC!F187)","v":""},{"$f":"IF(A174=0,\"\",COC!G187)","v":""}]
[null,{"$f":"CONCATENATE(COC!A188,\"-\",COC!B165)","v":"-"},"",{"$f":"IF(A175=0,\"\",COC!C188)","v":""},{"$f":"IF(A175=0,\"\",COC!D188)","v":""},{"$f":"IF(A175=0,\"\",COC!E188)","v":""},{"$f":"IF(A175=0,\"\",COC!F188)","v":""},{"$f":"IF(A175=0,\"\",COC!G188)","v":""}]
[null,{"$f":"CONCATENATE(COC!A189,\"-\",COC!B166)","v":"-"},"",{"$f":"IF(A176=0,\"\",COC!C189)","v":""},{"$f":"IF(A176=0,\"\",COC!D189)","v":""},{"$f":"IF(A176=0,\"\",COC!E189)","v":""},{"$f":"IF(A176=0,\"\",COC!F189)","v":""},{"$f":"IF(A176=0,\"\",COC!G189)","v":""}]
[null,{"$f":"CONCATENATE(COC!A190,\"-\",COC!B167)","v":"-"},"",{"$f":"IF(A177=0,\"\",COC!C190)","v":""},{"$f":"IF(A177=0,\"\",COC!D190)","v":""},{"$f":"IF(A177=0,\"\",COC!E190)","v":""},{"$f":"IF(A177=0,\"\",COC!F190)","v":""},{"$f":"IF(A177=0,\"\",COC!G190)","v":""}]
[null,{"$f":"CONCATENATE(COC!A191,\"-\",COC!B168)","v":"-"},"",{"$f":"IF(A178=0,\"\",COC!C191)","v":""},{"$f":"IF(A178=0,\"\",COC!D191)","v":""},{"$f":"IF(A178=0,\"\",COC!E191)","v":""},{"$f":"IF(A178=0,\"\",COC!F191)","v":""},{"$f":"IF(A178=0,\"\",COC!G191)","v":""}]
[null,{"$f":"CONCATENATE(COC!A192,\"-\",COC!B169)","v":"-"},"",{"$f":"IF(A179=0,\"\",COC!C192)","v":""},{"$f":"IF(A179=0,\"\",COC!D192)","v":""},{"$f":"IF(A179=0,\"\",COC!E192)","v":""},{"$f":"IF(A179=0,\"\",COC!F192)","v":""},{"$f":"IF(A179=0,\"\",COC!G192)","v":""}]
[null,{"$f":"CONCATENATE(COC!A193,\"-\",COC!B170)","v":"-"},"",{"$f":"IF(A180=0,\"\",COC!C193)","v":""},{"$f":"IF(A180=0,\"\",COC!D193)","v":""},{"$f":"IF(A180=0,\"\",COC!E193)","v":""},{"$f":"IF(A180=0,\"\",COC!F193)","v":""},{"$f":"IF(A180=0,\"\",COC!G193)","v":""}]
[null,{"$f":"CONCATENATE(COC!A194,\"-\",COC!B171)","v":"-"},"",{"$f":"IF(A181=0,\"\",COC!C194)","v":""},{"$f":"IF(A181=0,\"\",COC!D194)","v":""},{"$f":"IF(A181=0,\"\",COC!E194)","v":""},{"$f":"IF(A181=0,\"\",COC!F194)","v":""},{"$f":"IF(A181=0,\"\",COC!G194)","v":""}]
[null,{"$f":"CONCATENATE(COC!A195,\"-\",COC!B172)","v":"-"},"",{"$f":"IF(A182=0,\"\",COC!C195)","v":""},{"$f":"IF(A182=0,\"\",COC!D195)","v":""},{"$f":"IF(A182=0,\"\",COC!E195)","v":""},{"$f":"IF(A182=0,\"\",COC!F195)","v":""},{"$f":"IF(A182=0,\"\",COC!G195)","v":""}]
[null,{"$f":"CONCATENATE(COC!A196,\"-\",COC!B173)","v":"-"},"",{"$f":"IF(A183=0,\"\",COC!C196)","v":""},{"$f":"IF(A183=0,\"\",COC!D196)","v":""},{"$f":"IF(A183=0,\"\",COC!E196)","v":""},{"$f":"IF(A183=0,\"\",COC!F196)","v":""},{"$f":"IF(A183=0,\"\",COC!G196)","v":""}]
[null,{"$f":"CONCATENATE(COC!A197,\"-\",COC!B174)","v":"-"},"",{"$f":"IF(A184=0,\"\",COC!C197)","v":""},{"$f":"IF(A184=0,\"\",COC!D197)","v":""},{"$f":"IF(A184=0,\"\",COC!E197)","v":""},{"$f":"IF(A184=0,\"\",COC!F197)","v":""},{"$f":"IF(A184=0,\"\",COC!G197)","v":""}]
[null,{"$f":"CONCATENATE(COC!A198,\"-\",COC!B175)","v":"-"},"",{"$f":"IF(A185=0,\"\",COC!C198)","v":""},{"$f":"IF(A185=0,\"\",COC!D198)","v":""},{"$f":"IF(A185=0,\"\",COC!E198)","v":""},{"$f":"IF(A185=0,\"\",COC!F198)","v":""},{"$f":"IF(A185=0,\"\",COC!G198)","v":""}]
[null,{"$f":"CONCATENATE(COC!A199,\"-\",COC!B176)","v":"-"},"",{"$f":"IF(A186=0,\"\",COC!C199)","v":""},{"$f":"IF(A186=0,\"\",COC!D199)","v":""},{"$f":"IF(A186=0,\"\",COC!E199)","v":""},{"$f":"IF(A186=0,\"\",COC!F199)","v":""},{"$f":"IF(A186=0,\"\",COC!G199)","v":""}]
[null,{"$f":"CONCATENATE(COC!A200,\"-\",COC!B177)","v":"-"},"",{"$f":"IF(A187=0,\"\",COC!C200)","v":""},{"$f":"IF(A187=0,\"\",COC!D200)","v":""},{"$f":"IF(A187=0,\"\",COC!E200)","v":""},{"$f":"IF(A187=0,\"\",COC!F200)","v":""},{"$f":"IF(A187=0,\"\",COC!G200)","v":""}]
[null,{"$f":"CONCATENATE(COC!A201,\"-\",COC!B178)","v":"-"},"",{"$f":"IF(A188=0,\"\",COC!C201)","v":""},{"$f":"IF(A188=0,\"\",COC!D201)","v":""},{"$f":"IF(A188=0,\"\",COC!E201)","v":""},{"$f":"IF(A188=0,\"\",COC!F201)","v":""},{"$f":"IF(A188=0,\"\",COC!G201)","v":""}]
[null,{"$f":"CONCATENATE(COC!A202,\"-\",COC!B179)","v":"-"},"",{"$f":"IF(A189=0,\"\",COC!C202)","v":""},{"$f":"IF(A189=0,\"\",COC!D202)","v":""},{"$f":"IF(A189=0,\"\",COC!E202)","v":""},{"$f":"IF(A189=0,\"\",COC!F202)","v":""},{"$f":"IF(A189=0,\"\",COC!G202)","v":""}]
[null,{"$f":"CONCATENATE(COC!A203,\"-\",COC!B180)","v":"-"},"",{"$f":"IF(A190=0,\"\",COC!C203)","v":""},{"$f":"IF(A190=0,\"\",COC!D203)","v":""},{"$f":"IF(A190=0,\"\",COC!E203)","v":""},{"$f":"IF(A190=0,\"\",COC!F203)","v":""},{"$f":"IF(A190=0,\"\",COC!G203)","v":""}]
[null,{"$f":"CONCATENATE(COC!A204,\"-\",COC!B181)","v":"-"},"",{"$f":"IF(A191=0,\"\",COC!C204)","v":""},{"$f":"IF(A191=0,\"\",COC!D204)","v":""},{"$f":"IF(A191=0,\"\",COC!E204)","v":""},{"$f":"IF(A191=0,\"\",COC!F204)","v":""},{"$f":"IF(A191=0,\"\",COC!G204)","v":""}]
[null,{"$f":"CONCATENATE(COC!A205,\"-\",COC!B182)","v":"-"},"",{"$f":"IF(A192=0,\"\",COC!C205)","v":""},{"$f":"IF(A192=0,\"\",COC!D205)","v":""},{"$f":"IF(A192=0,\"\",COC!E205)","v":""},{"$f":"IF(A192=0,\"\",COC!F205)","v":""},{"$f":"IF(A192=0,\"\",COC!G205)","v":""}]
[null,{"$f":"CONCATENATE(COC!A206,\"-\",COC!B183)","v":"-"},"",{"$f":"IF(A193=0,\"\",COC!C206)","v":""},{"$f":"IF(A193=0,\"\",COC!D206)","v":""},{"$f":"IF(A193=0,\"\",COC!E206)","v":""},{"$f":"IF(A193=0,\"\",COC!F206)","v":""},{"$f":"IF(A193=0,\"\",COC!G206)","v":""}]
[null,{"$f":"CONCATENATE(COC!A207,\"-\",COC!B184)","v":"-"},"",{"$f":"IF(A194=0,\"\",COC!C207)","v":""},{"$f":"IF(A194=0,\"\",COC!D207)","v":""},{"$f":"IF(A194=0,\"\",COC!E207)","v":""},{"$f":"IF(A194=0,\"\",COC!F207)","v":""},{"$f":"IF(A194=0,\"\",COC!G207)","v":""}]
[null,{"$f":"CONCATENATE(COC!A208,\"-\",COC!B185)","v":"-"},"",{"$f":"IF(A195=0,\"\",COC!C208)","v":""},{"$f":"IF(A195=0,\"\",COC!D208)","v":""},{"$f":"IF(A195=0,\"\",COC!E208)","v":""},{"$f":"IF(A195=0,\"\",COC!F208)","v":""},{"$f":"IF(A195=0,\"\",COC!G208)","v":""}]
[null,{"$f":"CONCATENATE(COC!A209,\"-\",COC!B186)","v":"-"},"",{"$f":"IF(A196=0,\"\",COC!C209)","v":""},{"$f":"IF(A196=0,\"\",COC!D209)","v":""},{"$f":"IF(A196=0,\"\",COC!E209)","v":""},{"$f":"IF(A196=0,\"\",COC!F209)","v":""},{"$f":"IF(A196=0,\"\",COC!G209)","v":""}]
[null,{"$f":"CONCATENATE(COC!A210,\"-\",COC!B187)","v":"-"},"",{"$f":"IF(A197=0,\"\",COC!C210)","v":""},{"$f":"IF(A197=0,\"\",COC!D210)","v":""},{"$f":"IF(A197=0,\"\",COC!E210)","v":""},{"$f":"IF(A197=0,\"\",COC!F210)","v":""},{"$f":"IF(A197=0,\"\",COC!G210)","v":""}]
[null,{"$f":"CONCATENATE(COC!A211,\"-\",COC!B188)","v":"-"},"",{"$f":"IF(A198=0,\"\",COC!C211)","v":""},{"$f":"IF(A198=0,\"\",COC!D211)","v":""},{"$f":"IF(A198=0,\"\",COC!E211)","v":""},{"$f":"IF(A198=0,\"\",COC!F211)","v":""},{"$f":"IF(A198=0,\"\",COC!G211)","v":""}]
[null,{"$f":"CONCATENATE(COC!A212,\"-\",COC!B189)","v":"-"},"",{"$f":"IF(A199=0,\"\",COC!C212)","v":""},{"$f":"IF(A199=0,\"\",COC!D212)","v":""},{"$f":"IF(A199=0,\"\",COC!E212)","v":""},{"$f":"IF(A199=0,\"\",COC!F212)","v":""},{"$f":"IF(A199=0,\"\",COC!G212)","v":""}]
[null,{"$f":"CONCATENATE(COC!A213,\"-\",COC!B190)","v":"-"},"",{"$f":"IF(A200=0,\"\",COC!C213)","v":""},{"$f":"IF(A200=0,\"\",COC!D213)","v":""},{"$f":"IF(A200=0,\"\",COC!E213)","v":""},{"$f":"IF(A200=0,\"\",COC!F213)","v":""},{"$f":"IF(A200=0,\"\",COC!G213)","v":""}]
[null,{"$f":"CONCATENATE(COC!A214,\"-\",COC!B191)","v":"-"},"",{"$f":"IF(A201=0,\"\",COC!C214)","v":""},{"$f":"IF(A201=0,\"\",COC!D214)","v":""},{"$f":"IF(A201=0,\"\",COC!E214)","v":""},{"$f":"IF(A201=0,\"\",COC!F214)","v":""},{"$f":"IF(A201=0,\"\",COC!G214)","v":""}]
[null,{"$f":"CONCATENATE(COC!A215,\"-\",COC!B192)","v":"-"},"",{"$f":"IF(A202=0,\"\",COC!C215)","v":""},{"$f":"IF(A202=0,\"\",COC!D215)","v":""},{"$f":"IF(A202=0,\"\",COC!E215)","v":""},{"$f":"IF(A202=0,\"\",COC!F215)","v":""},{"$f":"IF(A202=0,\"\",COC!G215)","v":""}]
[null,{"$f":"CONCATENATE(COC!A216,\"-\",COC!B193)","v":"-"},"",{"$f":"IF(A203=0,\"\",COC!C216)","v":""},{"$f":"IF(A203=0,\"\",COC!D216)","v":""},{"$f":"IF(A203=0,\"\",COC!E216)","v":""},{"$f":"IF(A203=0,\"\",COC!F216)","v":""},{"$f":"IF(A203=0,\"\",COC!G216)","v":""}]
[null,{"$f":"CONCATENATE(COC!A217,\"-\",COC!B194)","v":"-"},"",{"$f":"IF(A204=0,\"\",COC!C217)","v":""},{"$f":"IF(A204=0,\"\",COC!D217)","v":""},{"$f":"IF(A204=0,\"\",COC!E217)","v":""},{"$f":"IF(A204=0,\"\",COC!F217)","v":""},{"$f":"IF(A204=0,\"\",COC!G217)","v":""}]
[null,{"$f":"CONCATENATE(COC!A218,\"-\",COC!B195)","v":"-"},{"$f":"IF(A205=0,\"\",_xlfn.CONCAT($L$11,\"-\",A205))","v":""},{"$f":"IF(A205=0,\"\",COC!C218)","v":""},{"$f":"IF(A205=0,\"\",COC!D218)","v":""},{"$f":"IF(A205=0,\"\",COC!E218)","v":""},{"$f":"IF(A205=0,\"\",COC!F218)","v":""},{"$f":"IF(A205=0,\"\",COC!G218)","v":""}]
[null,{"$f":"CONCATENATE(COC!A219,\"-\",COC!B196)","v":"-"},"",{"$f":"IF(A206=0,\"\",COC!C219)","v":""},{"$f":"IF(A206=0,\"\",COC!D219)","v":""},{"$f":"IF(A206=0,\"\",COC!E219)","v":""},{"$f":"IF(A206=0,\"\",COC!F219)","v":""},{"$f":"IF(A206=0,\"\",COC!G219)","v":""}]
[null,{"$f":"CONCATENATE(COC!A220,\"-\",COC!B197)","v":"-"},"",{"$f":"IF(A207=0,\"\",COC!C220)","v":""},{"$f":"IF(A207=0,\"\",COC!D220)","v":""},{"$f":"IF(A207=0,\"\",COC!E220)","v":""},{"$f":"IF(A207=0,\"\",COC!F220)","v":""},{"$f":"IF(A207=0,\"\",COC!G220)","v":""}]
[null,{"$f":"CONCATENATE(COC!A221,\"-\",COC!B198)","v":"-"},"",{"$f":"IF(A208=0,\"\",COC!C221)","v":""},{"$f":"IF(A208=0,\"\",COC!D221)","v":""},{"$f":"IF(A208=0,\"\",COC!E221)","v":""},{"$f":"IF(A208=0,\"\",COC!F221)","v":""},{"$f":"IF(A208=0,\"\",COC!G221)","v":""}]
[null,{"$f":"CONCATENATE(COC!A222,\"-\",COC!B199)","v":"-"},"",{"$f":"IF(A209=0,\"\",COC!C222)","v":""},{"$f":"IF(A209=0,\"\",COC!D222)","v":""},{"$f":"IF(A209=0,\"\",COC!E222)","v":""},{"$f":"IF(A209=0,\"\",COC!F222)","v":""},{"$f":"IF(A209=0,\"\",COC!G222)","v":""}]
[null,{"$f":"CONCATENATE(COC!A223,\"-\",COC!B200)","v":"-"},"",{"$f":"IF(A210=0,\"\",COC!C223)","v":""},{"$f":"IF(A210=0,\"\",COC!D223)","v":""},{"$f":"IF(A210=0,\"\",COC!E223)","v":""},{"$f":"IF(A210=0,\"\",COC!F223)","v":""},{"$f":"IF(A210=0,\"\",COC!G223)","v":""}]
[null,{"$f":"CONCATENATE(COC!A224,\"-\",COC!B201)","v":"-"},"",{"$f":"IF(A211=0,\"\",COC!C224)","v":""},{"$f":"IF(A211=0,\"\",COC!D224)","v":""},{"$f":"IF(A211=0,\"\",COC!E224)","v":""},{"$f":"IF(A211=0,\"\",COC!F224)","v":""},{"$f":"IF(A211=0,\"\",COC!G224)","v":""}]
[null,{"$f":"CONCATENATE(COC!A225,\"-\",COC!B202)","v":"-"},"",{"$f":"IF(A212=0,\"\",COC!C225)","v":""},{"$f":"IF(A212=0,\"\",COC!D225)","v":""},{"$f":"IF(A212=0,\"\",COC!E225)","v":""},{"$f":"IF(A212=0,\"\",COC!F225)","v":""},{"$f":"IF(A212=0,\"\",COC!G225)","v":""}]
[null,{"$f":"CONCATENATE(COC!A226,\"-\",COC!B203)","v":"-"},"",{"$f":"IF(A213=0,\"\",COC!C226)","v":""},{"$f":"IF(A213=0,\"\",COC!D226)","v":""},{"$f":"IF(A213=0,\"\",COC!E226)","v":""},{"$f":"IF(A213=0,\"\",COC!F226)","v":""},{"$f":"IF(A213=0,\"\",COC!G226)","v":""}]
[null,{"$f":"CONCATENATE(COC!A227,\"-\",COC!B204)","v":"-"},"",{"$f":"IF(A214=0,\"\",COC!C227)","v":""},{"$f":"IF(A214=0,\"\",COC!D227)","v":""},{"$f":"IF(A214=0,\"\",COC!E227)","v":""},{"$f":"IF(A214=0,\"\",COC!F227)","v":""},{"$f":"IF(A214=0,\"\",COC!G227)","v":""}]
[null,{"$f":"CONCATENATE(COC!A228,\"-\",COC!B205)","v":"-"},"",{"$f":"IF(A215=0,\"\",COC!C228)","v":""},{"$f":"IF(A215=0,\"\",COC!D228)","v":""},{"$f":"IF(A215=0,\"\",COC!E228)","v":""},{"$f":"IF(A215=0,\"\",COC!F228)","v":""},{"$f":"IF(A215=0,\"\",COC!G228)","v":""}]
[null,{"$f":"CONCATENATE(COC!A229,\"-\",COC!B206)","v":"-"},"",{"$f":"IF(A216=0,\"\",COC!C229)","v":""},{"$f":"IF(A216=0,\"\",COC!D229)","v":""},{"$f":"IF(A216=0,\"\",COC!E229)","v":""},{"$f":"IF(A216=0,\"\",COC!F229)","v":""},{"$f":"IF(A216=0,\"\",COC!G229)","v":""}]
[null,{"$f":"CONCATENATE(COC!A230,\"-\",COC!B207)","v":"-"},"",{"$f":"IF(A217=0,\"\",COC!C230)","v":""},{"$f":"IF(A217=0,\"\",COC!D230)","v":""},{"$f":"IF(A217=0,\"\",COC!E230)","v":""},{"$f":"IF(A217=0,\"\",COC!F230)","v":""},{"$f":"IF(A217=0,\"\",COC!G230)","v":""}]
[null,{"$f":"CONCATENATE(COC!A231,\"-\",COC!B208)","v":"-"},"",{"$f":"IF(A218=0,\"\",COC!C231)","v":""},{"$f":"IF(A218=0,\"\",COC!D231)","v":""},{"$f":"IF(A218=0,\"\",COC!E231)","v":""},{"$f":"IF(A218=0,\"\",COC!F231)","v":""},{"$f":"IF(A218=0,\"\",COC!G231)","v":""}]
[null,{"$f":"CONCATENATE(COC!A232,\"-\",COC!B209)","v":"-"},"",{"$f":"IF(A219=0,\"\",COC!C232)","v":""},{"$f":"IF(A219=0,\"\",COC!D232)","v":""},{"$f":"IF(A219=0,\"\",COC!E232)","v":""},{"$f":"IF(A219=0,\"\",COC!F232)","v":""},{"$f":"IF(A219=0,\"\",COC!G232)","v":""}]
[null,{"$f":"CONCATENATE(COC!A233,\"-\",COC!B210)","v":"-"},"",{"$f":"IF(A220=0,\"\",COC!C233)","v":""},{"$f":"IF(A220=0,\"\",COC!D233)","v":""},{"$f":"IF(A220=0,\"\",COC!E233)","v":""},{"$f":"IF(A220=0,\"\",COC!F233)","v":""},{"$f":"IF(A220=0,\"\",COC!G233)","v":""}]
[null,{"$f":"CONCATENATE(COC!A234,\"-\",COC!B211)","v":"-"},"",{"$f":"IF(A221=0,\"\",COC!C234)","v":""},{"$f":"IF(A221=0,\"\",COC!D234)","v":""},{"$f":"IF(A221=0,\"\",COC!E234)","v":""},{"$f":"IF(A221=0,\"\",COC!F234)","v":""},{"$f":"IF(A221=0,\"\",COC!G234)","v":""}]
[null,{"$f":"CONCATENATE(COC!A235,\"-\",COC!B212)","v":"-"},"",{"$f":"IF(A222=0,\"\",COC!C235)","v":""},{"$f":"IF(A222=0,\"\",COC!D235)","v":""},{"$f":"IF(A222=0,\"\",COC!E235)","v":""},{"$f":"IF(A222=0,\"\",COC!F235)","v":""},{"$f":"IF(A222=0,\"\",COC!G235)","v":""}]
[null,{"$f":"CONCATENATE(COC!A236,\"-\",COC!B213)","v":"-"},"",{"$f":"IF(A223=0,\"\",COC!C236)","v":""},{"$f":"IF(A223=0,\"\",COC!D236)","v":""},{"$f":"IF(A223=0,\"\",COC!E236)","v":""},{"$f":"IF(A223=0,\"\",COC!F236)","v":""},{"$f":"IF(A223=0,\"\",COC!G236)","v":""}]
[null,{"$f":"CONCATENATE(COC!A237,\"-\",COC!B214)","v":"-"},"",{"$f":"IF(A224=0,\"\",COC!C237)","v":""},{"$f":"IF(A224=0,\"\",COC!D237)","v":""},{"$f":"IF(A224=0,\"\",COC!E237)","v":""},{"$f":"IF(A224=0,\"\",COC!F237)","v":""},{"$f":"IF(A224=0,\"\",COC!G237)","v":""}]
[null,{"$f":"CONCATENATE(COC!A238,\"-\",COC!B215)","v":"-"},"",{"$f":"IF(A225=0,\"\",COC!C238)","v":""},{"$f":"IF(A225=0,\"\",COC!D238)","v":""},{"$f":"IF(A225=0,\"\",COC!E238)","v":""},{"$f":"IF(A225=0,\"\",COC!F238)","v":""},{"$f":"IF(A225=0,\"\",COC!G238)","v":""}]
[null,{"$f":"CONCATENATE(COC!A239,\"-\",COC!B216)","v":"-"},"",{"$f":"IF(A226=0,\"\",COC!C239)","v":""},{"$f":"IF(A226=0,\"\",COC!D239)","v":""},{"$f":"IF(A226=0,\"\",COC!E239)","v":""},{"$f":"IF(A226=0,\"\",COC!F239)","v":""},{"$f":"IF(A226=0,\"\",COC!G239)","v":""}]
[null,{"$f":"CONCATENATE(COC!A240,\"-\",COC!B217)","v":"-"},"",{"$f":"IF(A227=0,\"\",COC!C240)","v":""},{"$f":"IF(A227=0,\"\",COC!D240)","v":""},{"$f":"IF(A227=0,\"\",COC!E240)","v":""},{"$f":"IF(A227=0,\"\",COC!F240)","v":""},{"$f":"IF(A227=0,\"\",COC!G240)","v":""}]
[null,{"$f":"CONCATENATE(COC!A241,\"-\",COC!B218)","v":"-"},"",{"$f":"IF(A228=0,\"\",COC!C241)","v":""},{"$f":"IF(A228=0,\"\",COC!D241)","v":""},{"$f":"IF(A228=0,\"\",COC!E241)","v":""},{"$f":"IF(A228=0,\"\",COC!F241)","v":""},{"$f":"IF(A228=0,\"\",COC!G241)","v":""}]
[null,{"$f":"CONCATENATE(COC!A242,\"-\",COC!B219)","v":"-"},"",{"$f":"IF(A229=0,\"\",COC!C242)","v":""},{"$f":"IF(A229=0,\"\",COC!D242)","v":""},{"$f":"IF(A229=0,\"\",COC!E242)","v":""},{"$f":"IF(A229=0,\"\",COC!F242)","v":""},{"$f":"IF(A229=0,\"\",COC!G242)","v":""}]
[null,{"$f":"CONCATENATE(COC!A243,\"-\",COC!B220)","v":"-"},"",{"$f":"IF(A230=0,\"\",COC!C243)","v":""},{"$f":"IF(A230=0,\"\",COC!D243)","v":""},{"$f":"IF(A230=0,\"\",COC!E243)","v":""},{"$f":"IF(A230=0,\"\",COC!F243)","v":""},{"$f":"IF(A230=0,\"\",COC!G243)","v":""}]
[null,{"$f":"CONCATENATE(COC!A244,\"-\",COC!B221)","v":"-"},"",{"$f":"IF(A231=0,\"\",COC!C244)","v":""},{"$f":"IF(A231=0,\"\",COC!D244)","v":""},{"$f":"IF(A231=0,\"\",COC!E244)","v":""},{"$f":"IF(A231=0,\"\",COC!F244)","v":""},{"$f":"IF(A231=0,\"\",COC!G244)","v":""}]
[null,{"$f":"CONCATENATE(COC!A245,\"-\",COC!B222)","v":"-"},"",{"$f":"IF(A232=0,\"\",COC!C245)","v":""},{"$f":"IF(A232=0,\"\",COC!D245)","v":""},{"$f":"IF(A232=0,\"\",COC!E245)","v":""},{"$f":"IF(A232=0,\"\",COC!F245)","v":""},{"$f":"IF(A232=0,\"\",COC!G245)","v":""}]
[null,{"$f":"CONCATENATE(COC!A246,\"-\",COC!B223)","v":"-"},"",{"$f":"IF(A233=0,\"\",COC!C246)","v":""},{"$f":"IF(A233=0,\"\",COC!D246)","v":""},{"$f":"IF(A233=0,\"\",COC!E246)","v":""},{"$f":"IF(A233=0,\"\",COC!F246)","v":""},{"$f":"IF(A233=0,\"\",COC!G246)","v":""}]
[null,{"$f":"CONCATENATE(COC!A247,\"-\",COC!B224)","v":"-"},"",{"$f":"IF(A234=0,\"\",COC!C247)","v":""},{"$f":"IF(A234=0,\"\",COC!D247)","v":""},{"$f":"IF(A234=0,\"\",COC!E247)","v":""},{"$f":"IF(A234=0,\"\",COC!F247)","v":""},{"$f":"IF(A234=0,\"\",COC!G247)","v":""}]
[null,{"$f":"CONCATENATE(COC!A248,\"-\",COC!B225)","v":"-"},"",{"$f":"IF(A235=0,\"\",COC!C248)","v":""},{"$f":"IF(A235=0,\"\",COC!D248)","v":""},{"$f":"IF(A235=0,\"\",COC!E248)","v":""},{"$f":"IF(A235=0,\"\",COC!F248)","v":""},{"$f":"IF(A235=0,\"\",COC!G248)","v":""}]
[null,{"$f":"CONCATENATE(COC!A249,\"-\",COC!B226)","v":"-"},"",{"$f":"IF(A236=0,\"\",COC!C249)","v":""},{"$f":"IF(A236=0,\"\",COC!D249)","v":""},{"$f":"IF(A236=0,\"\",COC!E249)","v":""},{"$f":"IF(A236=0,\"\",COC!F249)","v":""},{"$f":"IF(A236=0,\"\",COC!G249)","v":""}]
[null,{"$f":"CONCATENATE(COC!A250,\"-\",COC!B227)","v":"-"},"",{"$f":"IF(A237=0,\"\",COC!C250)","v":""},{"$f":"IF(A237=0,\"\",COC!D250)","v":""},{"$f":"IF(A237=0,\"\",COC!E250)","v":""},{"$f":"IF(A237=0,\"\",COC!F250)","v":""},{"$f":"IF(A237=0,\"\",COC!G250)","v":""}]
[null,{"$f":"CONCATENATE(COC!A251,\"-\",COC!B228)","v":"-"},"",{"$f":"IF(A238=0,\"\",COC!C251)","v":""},{"$f":"IF(A238=0,\"\",COC!D251)","v":""},{"$f":"IF(A238=0,\"\",COC!E251)","v":""},{"$f":"IF(A238=0,\"\",COC!F251)","v":""},{"$f":"IF(A238=0,\"\",COC!G251)","v":""}]
[null,{"$f":"CONCATENATE(COC!A252,\"-\",COC!B229)","v":"-"},"",{"$f":"IF(A239=0,\"\",COC!C252)","v":""},{"$f":"IF(A239=0,\"\",COC!D252)","v":""},{"$f":"IF(A239=0,\"\",COC!E252)","v":""},{"$f":"IF(A239=0,\"\",COC!F252)","v":""},{"$f":"IF(A239=0,\"\",COC!G252)","v":""}]
[null,{"$f":"CONCATENATE(COC!A253,\"-\",COC!B230)","v":"-"},"",{"$f":"IF(A240=0,\"\",COC!C253)","v":""},{"$f":"IF(A240=0,\"\",COC!D253)","v":""},{"$f":"IF(A240=0,\"\",COC!E253)","v":""},{"$f":"IF(A240=0,\"\",COC!F253)","v":""},{"$f":"IF(A240=0,\"\",COC!G253)","v":""}]
[null,{"$f":"CONCATENATE(COC!A254,\"-\",COC!B231)","v":"-"},"",{"$f":"IF(A241=0,\"\",COC!C254)","v":""},{"$f":"IF(A241=0,\"\",COC!D254)","v":""},{"$f":"IF(A241=0,\"\",COC!E254)","v":""},{"$f":"IF(A241=0,\"\",COC!F254)","v":""},{"$f":"IF(A241=0,\"\",COC!G254)","v":""}]
[null,{"$f":"CONCATENATE(COC!A255,\"-\",COC!B232)","v":"-"},"",{"$f":"IF(A242=0,\"\",COC!C255)","v":""},{"$f":"IF(A242=0,\"\",COC!D255)","v":""},{"$f":"IF(A242=0,\"\",COC!E255)","v":""},{"$f":"IF(A242=0,\"\",COC!F255)","v":""},{"$f":"IF(A242=0,\"\",COC!G255)","v":""}]
[null,{"$f":"CONCATENATE(COC!A256,\"-\",COC!B233)","v":"-"},"",{"$f":"IF(A243=0,\"\",COC!C256)","v":""},{"$f":"IF(A243=0,\"\",COC!D256)","v":""},{"$f":"IF(A243=0,\"\",COC!E256)","v":""},{"$f":"IF(A243=0,\"\",COC!F256)","v":""},{"$f":"IF(A243=0,\"\",COC!G256)","v":""}]
[null,{"$f":"CONCATENATE(COC!A257,\"-\",COC!B234)","v":"-"},"",{"$f":"IF(A244=0,\"\",COC!C257)","v":""},{"$f":"IF(A244=0,\"\",COC!D257)","v":""},{"$f":"IF(A244=0,\"\",COC!E257)","v":""},{"$f":"IF(A244=0,\"\",COC!F257)","v":""},{"$f":"IF(A244=0,\"\",COC!G257)","v":""}]
[null,{"$f":"CONCATENATE(COC!A258,\"-\",COC!B235)","v":"-"},"",{"$f":"IF(A245=0,\"\",COC!C258)","v":""},{"$f":"IF(A245=0,\"\",COC!D258)","v":""},{"$f":"IF(A245=0,\"\",COC!E258)","v":""},{"$f":"IF(A245=0,\"\",COC!F258)","v":""},{"$f":"IF(A245=0,\"\",COC!G258)","v":""}]
[null,{"$f":"CONCATENATE(COC!A259,\"-\",COC!B236)","v":"-"},"",{"$f":"IF(A246=0,\"\",COC!C259)","v":""},{"$f":"IF(A246=0,\"\",COC!D259)","v":""},{"$f":"IF(A246=0,\"\",COC!E259)","v":""},{"$f":"IF(A246=0,\"\",COC!F259)","v":""},{"$f":"IF(A246=0,\"\",COC!G259)","v":""}]
[null,{"$f":"CONCATENATE(COC!A260,\"-\",COC!B237)","v":"-"},"",{"$f":"IF(A247=0,\"\",COC!C260)","v":""},{"$f":"IF(A247=0,\"\",COC!D260)","v":""},{"$f":"IF(A247=0,\"\",COC!E260)","v":""},{"$f":"IF(A247=0,\"\",COC!F260)","v":""},{"$f":"IF(A247=0,\"\",COC!G260)","v":""}]
[null,{"$f":"CONCATENATE(COC!A261,\"-\",COC!B238)","v":"-"},"",{"$f":"IF(A248=0,\"\",COC!C261)","v":""},{"$f":"IF(A248=0,\"\",COC!D261)","v":""},{"$f":"IF(A248=0,\"\",COC!E261)","v":""},{"$f":"IF(A248=0,\"\",COC!F261)","v":""},{"$f":"IF(A248=0,\"\",COC!G261)","v":""}]
[null,{"$f":"CONCATENATE(COC!A262,\"-\",COC!B239)","v":"-"},"",{"$f":"IF(A249=0,\"\",COC!C262)","v":""},{"$f":"IF(A249=0,\"\",COC!D262)","v":""},{"$f":"IF(A249=0,\"\",COC!E262)","v":""},{"$f":"IF(A249=0,\"\",COC!F262)","v":""},{"$f":"IF(A249=0,\"\",COC!G262)","v":""}]
[null,{"$f":"CONCATENATE(COC!A263,\"-\",COC!B240)","v":"-"},"",{"$f":"IF(A250=0,\"\",COC!C263)","v":""},{"$f":"IF(A250=0,\"\",COC!D263)","v":""},{"$f":"IF(A250=0,\"\",COC!E263)","v":""},{"$f":"IF(A250=0,\"\",COC!F263)","v":""},{"$f":"IF(A250=0,\"\",COC!G263)","v":""}]
[null,{"$f":"CONCATENATE(COC!A264,\"-\",COC!B241)","v":"-"},"",{"$f":"IF(A251=0,\"\",COC!C264)","v":""},{"$f":"IF(A251=0,\"\",COC!D264)","v":""},{"$f":"IF(A251=0,\"\",COC!E264)","v":""},{"$f":"IF(A251=0,\"\",COC!F264)","v":""},{"$f":"IF(A251=0,\"\",COC!G264)","v":""}]
[null,{"$f":"CONCATENATE(COC!A265,\"-\",COC!B242)","v":"-"},"",{"$f":"IF(A252=0,\"\",COC!C265)","v":""},{"$f":"IF(A252=0,\"\",COC!D265)","v":""},{"$f":"IF(A252=0,\"\",COC!E265)","v":""},{"$f":"IF(A252=0,\"\",COC!F265)","v":""},{"$f":"IF(A252=0,\"\",COC!G265)","v":""}]
[null,{"$f":"CONCATENATE(COC!A266,\"-\",COC!B243)","v":"-"},"",{"$f":"IF(A253=0,\"\",COC!C266)","v":""},{"$f":"IF(A253=0,\"\",COC!D266)","v":""},{"$f":"IF(A253=0,\"\",COC!E266)","v":""},{"$f":"IF(A253=0,\"\",COC!F266)","v":""},{"$f":"IF(A253=0,\"\",COC!G266)","v":""}]
[null,{"$f":"CONCATENATE(COC!A267,\"-\",COC!B244)","v":"-"},"",{"$f":"IF(A254=0,\"\",COC!C267)","v":""},{"$f":"IF(A254=0,\"\",COC!D267)","v":""},{"$f":"IF(A254=0,\"\",COC!E267)","v":""},{"$f":"IF(A254=0,\"\",COC!F267)","v":""},{"$f":"IF(A254=0,\"\",COC!G267)","v":""}]
[null,{"$f":"CONCATENATE(COC!A268,\"-\",COC!B245)","v":"-"},"",{"$f":"IF(A255=0,\"\",COC!C268)","v":""},{"$f":"IF(A255=0,\"\",COC!D268)","v":""},{"$f":"IF(A255=0,\"\",COC!E268)","v":""},{"$f":"IF(A255=0,\"\",COC!F268)","v":""},{"$f":"IF(A255=0,\"\",COC!G268)","v":""}]
[null,{"$f":"CONCATENATE(COC!A269,\"-\",COC!B246)","v":"-"},"",{"$f":"IF(A256=0,\"\",COC!C269)","v":""},{"$f":"IF(A256=0,\"\",COC!D269)","v":""},{"$f":"IF(A256=0,\"\",COC!E269)","v":""},{"$f":"IF(A256=0,\"\",COC!F269)","v":""},{"$f":"IF(A256=0,\"\",COC!G269)","v":""}]
[null,{"$f":"CONCATENATE(COC!A270,\"-\",COC!B247)","v":"-"},"",{"$f":"IF(A257=0,\"\",COC!C270)","v":""},{"$f":"IF(A257=0,\"\",COC!D270)","v":""},{"$f":"IF(A257=0,\"\",COC!E270)","v":""},{"$f":"IF(A257=0,\"\",COC!F270)","v":""},{"$f":"IF(A257=0,\"\",COC!G270)","v":""}]
[null,{"$f":"CONCATENATE(COC!A271,\"-\",COC!B248)","v":"-"},"",{"$f":"IF(A258=0,\"\",COC!C271)","v":""},{"$f":"IF(A258=0,\"\",COC!D271)","v":""},{"$f":"IF(A258=0,\"\",COC!E271)","v":""},{"$f":"IF(A258=0,\"\",COC!F271)","v":""},{"$f":"IF(A258=0,\"\",COC!G271)","v":""}]
[null,{"$f":"CONCATENATE(COC!A272,\"-\",COC!B249)","v":"-"},"",{"$f":"IF(A259=0,\"\",COC!C272)","v":""},{"$f":"IF(A259=0,\"\",COC!D272)","v":""},{"$f":"IF(A259=0,\"\",COC!E272)","v":""},{"$f":"IF(A259=0,\"\",COC!F272)","v":""},{"$f":"IF(A259=0,\"\",COC!G272)","v":""}]
[null,{"$f":"CONCATENATE(COC!A273,\"-\",COC!B250)","v":"-"},"",{"$f":"IF(A260=0,\"\",COC!C273)","v":""},{"$f":"IF(A260=0,\"\",COC!D273)","v":""},{"$f":"IF(A260=0,\"\",COC!E273)","v":""},{"$f":"IF(A260=0,\"\",COC!F273)","v":""},{"$f":"IF(A260=0,\"\",COC!G273)","v":""}]
[null,{"$f":"CONCATENATE(COC!A274,\"-\",COC!B251)","v":"-"},"",{"$f":"IF(A261=0,\"\",COC!C274)","v":""},{"$f":"IF(A261=0,\"\",COC!D274)","v":""},{"$f":"IF(A261=0,\"\",COC!E274)","v":""},{"$f":"IF(A261=0,\"\",COC!F274)","v":""},{"$f":"IF(A261=0,\"\",COC!G274)","v":""}]
[null,{"$f":"CONCATENATE(COC!A275,\"-\",COC!B252)","v":"-"},"",{"$f":"IF(A262=0,\"\",COC!C275)","v":""},{"$f":"IF(A262=0,\"\",COC!D275)","v":""},{"$f":"IF(A262=0,\"\",COC!E275)","v":""},{"$f":"IF(A262=0,\"\",COC!F275)","v":""},{"$f":"IF(A262=0,\"\",COC!G275)","v":""}]
[null,{"$f":"CONCATENATE(COC!A276,\"-\",COC!B253)","v":"-"},"",{"$f":"IF(A263=0,\"\",COC!C276)","v":""},{"$f":"IF(A263=0,\"\",COC!D276)","v":""},{"$f":"IF(A263=0,\"\",COC!E276)","v":""},{"$f":"IF(A263=0,\"\",COC!F276)","v":""},{"$f":"IF(A263=0,\"\",COC!G276)","v":""}]
[null,{"$f":"CONCATENATE(COC!A277,\"-\",COC!B254)","v":"-"},"",{"$f":"IF(A264=0,\"\",COC!C277)","v":""},{"$f":"IF(A264=0,\"\",COC!D277)","v":""},{"$f":"IF(A264=0,\"\",COC!E277)","v":""},{"$f":"IF(A264=0,\"\",COC!F277)","v":""},{"$f":"IF(A264=0,\"\",COC!G277)","v":""}]
[null,{"$f":"CONCATENATE(COC!A278,\"-\",COC!B255)","v":"-"},"",{"$f":"IF(A265=0,\"\",COC!C278)","v":""},{"$f":"IF(A265=0,\"\",COC!D278)","v":""},{"$f":"IF(A265=0,\"\",COC!E278)","v":""},{"$f":"IF(A265=0,\"\",COC!F278)","v":""},{"$f":"IF(A265=0,\"\",COC!G278)","v":""}]
[null,{"$f":"CONCATENATE(COC!A279,\"-\",COC!B256)","v":"-"},"",{"$f":"IF(A266=0,\"\",COC!C279)","v":""},{"$f":"IF(A266=0,\"\",COC!D279)","v":""},{"$f":"IF(A266=0,\"\",COC!E279)","v":""},{"$f":"IF(A266=0,\"\",COC!F279)","v":""},{"$f":"IF(A266=0,\"\",COC!G279)","v":""}]
[null,{"$f":"CONCATENATE(COC!A280,\"-\",COC!B257)","v":"-"},"",{"$f":"IF(A267=0,\"\",COC!C280)","v":""},{"$f":"IF(A267=0,\"\",COC!D280)","v":""},{"$f":"IF(A267=0,\"\",COC!E280)","v":""},{"$f":"IF(A267=0,\"\",COC!F280)","v":""},{"$f":"IF(A267=0,\"\",COC!G280)","v":""}]
[null,{"$f":"CONCATENATE(COC!A281,\"-\",COC!B258)","v":"-"},"",{"$f":"IF(A268=0,\"\",COC!C281)","v":""},{"$f":"IF(A268=0,\"\",COC!D281)","v":""},{"$f":"IF(A268=0,\"\",COC!E281)","v":""},{"$f":"IF(A268=0,\"\",COC!F281)","v":""},{"$f":"IF(A268=0,\"\",COC!G281)","v":""}]
[null,{"$f":"CONCATENATE(COC!A282,\"-\",COC!B259)","v":"-"},{"$f":"IF(A269=0,\"\",_xlfn.CONCAT($L$11,\"-\",A269))","v":""},{"$f":"IF(A269=0,\"\",COC!C282)","v":""},{"$f":"IF(A269=0,\"\",COC!D282)","v":""},{"$f":"IF(A269=0,\"\",COC!E282)","v":""},{"$f":"IF(A269=0,\"\",COC!F282)","v":""},{"$f":"IF(A269=0,\"\",COC!G282)","v":""}]
[null,{"$f":"CONCATENATE(COC!A283,\"-\",COC!B260)","v":"-"},"",{"$f":"IF(A270=0,\"\",COC!C283)","v":""},{"$f":"IF(A270=0,\"\",COC!D283)","v":""},{"$f":"IF(A270=0,\"\",COC!E283)","v":""},{"$f":"IF(A270=0,\"\",COC!F283)","v":""},{"$f":"IF(A270=0,\"\",COC!G283)","v":""}]
[null,{"$f":"CONCATENATE(COC!A284,\"-\",COC!B261)","v":"-"},"",{"$f":"IF(A271=0,\"\",COC!C284)","v":""},{"$f":"IF(A271=0,\"\",COC!D284)","v":""},{"$f":"IF(A271=0,\"\",COC!E284)","v":""},{"$f":"IF(A271=0,\"\",COC!F284)","v":""},{"$f":"IF(A271=0,\"\",COC!G284)","v":""}]
[null,{"$f":"CONCATENATE(COC!A285,\"-\",COC!B262)","v":"-"},"",{"$f":"IF(A272=0,\"\",COC!C285)","v":""},{"$f":"IF(A272=0,\"\",COC!D285)","v":""},{"$f":"IF(A272=0,\"\",COC!E285)","v":""},{"$f":"IF(A272=0,\"\",COC!F285)","v":""},{"$f":"IF(A272=0,\"\",COC!G285)","v":""}]
[null,{"$f":"CONCATENATE(COC!A286,\"-\",COC!B263)","v":"-"},"",{"$f":"IF(A273=0,\"\",COC!C286)","v":""},{"$f":"IF(A273=0,\"\",COC!D286)","v":""},{"$f":"IF(A273=0,\"\",COC!E286)","v":""},{"$f":"IF(A273=0,\"\",COC!F286)","v":""},{"$f":"IF(A273=0,\"\",COC!G286)","v":""}]
[null,{"$f":"CONCATENATE(COC!A287,\"-\",COC!B264)","v":"-"},"",{"$f":"IF(A274=0,\"\",COC!C287)","v":""},{"$f":"IF(A274=0,\"\",COC!D287)","v":""},{"$f":"IF(A274=0,\"\",COC!E287)","v":""},{"$f":"IF(A274=0,\"\",COC!F287)","v":""},{"$f":"IF(A274=0,\"\",COC!G287)","v":""}]
[null,{"$f":"CONCATENATE(COC!A288,\"-\",COC!B265)","v":"-"},"",{"$f":"IF(A275=0,\"\",COC!C288)","v":""},{"$f":"IF(A275=0,\"\",COC!D288)","v":""},{"$f":"IF(A275=0,\"\",COC!E288)","v":""},{"$f":"IF(A275=0,\"\",COC!F288)","v":""},{"$f":"IF(A275=0,\"\",COC!G288)","v":""}]
[null,{"$f":"CONCATENATE(COC!A289,\"-\",COC!B266)","v":"-"},"",{"$f":"IF(A276=0,\"\",COC!C289)","v":""},{"$f":"IF(A276=0,\"\",COC!D289)","v":""},{"$f":"IF(A276=0,\"\",COC!E289)","v":""},{"$f":"IF(A276=0,\"\",COC!F289)","v":""},{"$f":"IF(A276=0,\"\",COC!G289)","v":""}]
[null,{"$f":"CONCATENATE(COC!A290,\"-\",COC!B267)","v":"-"},"",{"$f":"IF(A277=0,\"\",COC!C290)","v":""},{"$f":"IF(A277=0,\"\",COC!D290)","v":""},{"$f":"IF(A277=0,\"\",COC!E290)","v":""},{"$f":"IF(A277=0,\"\",COC!F290)","v":""},{"$f":"IF(A277=0,\"\",COC!G290)","v":""}]
[null,{"$f":"CONCATENATE(COC!A291,\"-\",COC!B268)","v":"-"},"",{"$f":"IF(A278=0,\"\",COC!C291)","v":""},{"$f":"IF(A278=0,\"\",COC!D291)","v":""},{"$f":"IF(A278=0,\"\",COC!E291)","v":""},{"$f":"IF(A278=0,\"\",COC!F291)","v":""},{"$f":"IF(A278=0,\"\",COC!G291)","v":""}]
[null,{"$f":"CONCATENATE(COC!A292,\"-\",COC!B269)","v":"-"},"",{"$f":"IF(A279=0,\"\",COC!C292)","v":""},{"$f":"IF(A279=0,\"\",COC!D292)","v":""},{"$f":"IF(A279=0,\"\",COC!E292)","v":""},{"$f":"IF(A279=0,\"\",COC!F292)","v":""},{"$f":"IF(A279=0,\"\",COC!G292)","v":""}]
[null,{"$f":"CONCATENATE(COC!A293,\"-\",COC!B270)","v":"-"},"",{"$f":"IF(A280=0,\"\",COC!C293)","v":""},{"$f":"IF(A280=0,\"\",COC!D293)","v":""},{"$f":"IF(A280=0,\"\",COC!E293)","v":""},{"$f":"IF(A280=0,\"\",COC!F293)","v":""},{"$f":"IF(A280=0,\"\",COC!G293)","v":""}]
[null,{"$f":"CONCATENATE(COC!A294,\"-\",COC!B271)","v":"-"},"",{"$f":"IF(A281=0,\"\",COC!C294)","v":""},{"$f":"IF(A281=0,\"\",COC!D294)","v":""},{"$f":"IF(A281=0,\"\",COC!E294)","v":""},{"$f":"IF(A281=0,\"\",COC!F294)","v":""},{"$f":"IF(A281=0,\"\",COC!G294)","v":""}]
[null,{"$f":"CONCATENATE(COC!A295,\"-\",COC!B272)","v":"-"},"",{"$f":"IF(A282=0,\"\",COC!C295)","v":""},{"$f":"IF(A282=0,\"\",COC!D295)","v":""},{"$f":"IF(A282=0,\"\",COC!E295)","v":""},{"$f":"IF(A282=0,\"\",COC!F295)","v":""},{"$f":"IF(A282=0,\"\",COC!G295)","v":""}]
[null,{"$f":"CONCATENATE(COC!A296,\"-\",COC!B273)","v":"-"},"",{"$f":"IF(A283=0,\"\",COC!C296)","v":""},{"$f":"IF(A283=0,\"\",COC!D296)","v":""},{"$f":"IF(A283=0,\"\",COC!E296)","v":""},{"$f":"IF(A283=0,\"\",COC!F296)","v":""},{"$f":"IF(A283=0,\"\",COC!G296)","v":""}]
[null,{"$f":"CONCATENATE(COC!A297,\"-\",COC!B274)","v":"-"},"",{"$f":"IF(A284=0,\"\",COC!C297)","v":""},{"$f":"IF(A284=0,\"\",COC!D297)","v":""},{"$f":"IF(A284=0,\"\",COC!E297)","v":""},{"$f":"IF(A284=0,\"\",COC!F297)","v":""},{"$f":"IF(A284=0,\"\",COC!G297)","v":""}]
[null,{"$f":"CONCATENATE(COC!A298,\"-\",COC!B275)","v":"-"},"",{"$f":"IF(A285=0,\"\",COC!C298)","v":""},{"$f":"IF(A285=0,\"\",COC!D298)","v":""},{"$f":"IF(A285=0,\"\",COC!E298)","v":""},{"$f":"IF(A285=0,\"\",COC!F298)","v":""},{"$f":"IF(A285=0,\"\",COC!G298)","v":""}]
[null,{"$f":"CONCATENATE(COC!A299,\"-\",COC!B276)","v":"-"},"",{"$f":"IF(A286=0,\"\",COC!C299)","v":""},{"$f":"IF(A286=0,\"\",COC!D299)","v":""},{"$f":"IF(A286=0,\"\",COC!E299)","v":""},{"$f":"IF(A286=0,\"\",COC!F299)","v":""},{"$f":"IF(A286=0,\"\",COC!G299)","v":""}]
[null,{"$f":"CONCATENATE(COC!A300,\"-\",COC!B277)","v":"-"},"",{"$f":"IF(A287=0,\"\",COC!C300)","v":""},{"$f":"IF(A287=0,\"\",COC!D300)","v":""},{"$f":"IF(A287=0,\"\",COC!E300)","v":""},{"$f":"IF(A287=0,\"\",COC!F300)","v":""},{"$f":"IF(A287=0,\"\",COC!G300)","v":""}]
[null,{"$f":"CONCATENATE(COC!A301,\"-\",COC!B278)","v":"-"},"",{"$f":"IF(A288=0,\"\",COC!C301)","v":""},{"$f":"IF(A288=0,\"\",COC!D301)","v":""},{"$f":"IF(A288=0,\"\",COC!E301)","v":""},{"$f":"IF(A288=0,\"\",COC!F301)","v":""},{"$f":"IF(A288=0,\"\",COC!G301)","v":""}]
[null,{"$f":"CONCATENATE(COC!A302,\"-\",COC!B279)","v":"-"},"",{"$f":"IF(A289=0,\"\",COC!C302)","v":""},{"$f":"IF(A289=0,\"\",COC!D302)","v":""},{"$f":"IF(A289=0,\"\",COC!E302)","v":""},{"$f":"IF(A289=0,\"\",COC!F302)","v":""},{"$f":"IF(A289=0,\"\",COC!G302)","v":""}]
[null,{"$f":"CONCATENATE(COC!A303,\"-\",COC!B280)","v":"-"},"",{"$f":"IF(A290=0,\"\",COC!C303)","v":""},{"$f":"IF(A290=0,\"\",COC!D303)","v":""},{"$f":"IF(A290=0,\"\",COC!E303)","v":""},{"$f":"IF(A290=0,\"\",COC!F303)","v":""},{"$f":"IF(A290=0,\"\",COC!G303)","v":""}]
[null,{"$f":"CONCATENATE(COC!A304,\"-\",COC!B281)","v":"-"},"",{"$f":"IF(A291=0,\"\",COC!C304)","v":""},{"$f":"IF(A291=0,\"\",COC!D304)","v":""},{"$f":"IF(A291=0,\"\",COC!E304)","v":""},{"$f":"IF(A291=0,\"\",COC!F304)","v":""},{"$f":"IF(A291=0,\"\",COC!G304)","v":""}]
[null,{"$f":"CONCATENATE(COC!A305,\"-\",COC!B282)","v":"-"},"",{"$f":"IF(A292=0,\"\",COC!C305)","v":""},{"$f":"IF(A292=0,\"\",COC!D305)","v":""},{"$f":"IF(A292=0,\"\",COC!E305)","v":""},{"$f":"IF(A292=0,\"\",COC!F305)","v":""},{"$f":"IF(A292=0,\"\",COC!G305)","v":""}]
[null,{"$f":"CONCATENATE(COC!A306,\"-\",COC!B283)","v":"-"},"",{"$f":"IF(A293=0,\"\",COC!C306)","v":""},{"$f":"IF(A293=0,\"\",COC!D306)","v":""},{"$f":"IF(A293=0,\"\",COC!E306)","v":""},{"$f":"IF(A293=0,\"\",COC!F306)","v":""},{"$f":"IF(A293=0,\"\",COC!G306)","v":""}]
[null,{"$f":"CONCATENATE(COC!A307,\"-\",COC!B284)","v":"-"},"",{"$f":"IF(A294=0,\"\",COC!C307)","v":""},{"$f":"IF(A294=0,\"\",COC!D307)","v":""},{"$f":"IF(A294=0,\"\",COC!E307)","v":""},{"$f":"IF(A294=0,\"\",COC!F307)","v":""},{"$f":"IF(A294=0,\"\",COC!G307)","v":""}]
[null,{"$f":"CONCATENATE(COC!A308,\"-\",COC!B285)","v":"-"},"",{"$f":"IF(A295=0,\"\",COC!C308)","v":""},{"$f":"IF(A295=0,\"\",COC!D308)","v":""},{"$f":"IF(A295=0,\"\",COC!E308)","v":""},{"$f":"IF(A295=0,\"\",COC!F308)","v":""},{"$f":"IF(A295=0,\"\",COC!G308)","v":""}]
[null,{"$f":"CONCATENATE(COC!A309,\"-\",COC!B286)","v":"-"},"",{"$f":"IF(A296=0,\"\",COC!C309)","v":""},{"$f":"IF(A296=0,\"\",COC!D309)","v":""},{"$f":"IF(A296=0,\"\",COC!E309)","v":""},{"$f":"IF(A296=0,\"\",COC!F309)","v":""},{"$f":"IF(A296=0,\"\",COC!G309)","v":""}]
[null,{"$f":"CONCATENATE(COC!A310,\"-\",COC!B287)","v":"-"},"",{"$f":"IF(A297=0,\"\",COC!C310)","v":""},{"$f":"IF(A297=0,\"\",COC!D310)","v":""},{"$f":"IF(A297=0,\"\",COC!E310)","v":""},{"$f":"IF(A297=0,\"\",COC!F310)","v":""},{"$f":"IF(A297=0,\"\",COC!G310)","v":""}]
[null,{"$f":"CONCATENATE(COC!A311,\"-\",COC!B288)","v":"-"},"",{"$f":"IF(A298=0,\"\",COC!C311)","v":""},{"$f":"IF(A298=0,\"\",COC!D311)","v":""},{"$f":"IF(A298=0,\"\",COC!E311)","v":""},{"$f":"IF(A298=0,\"\",COC!F311)","v":""},{"$f":"IF(A298=0,\"\",COC!G311)","v":""}]
[null,{"$f":"CONCATENATE(COC!A312,\"-\",COC!B289)","v":"-"},"",{"$f":"IF(A299=0,\"\",COC!C312)","v":""},{"$f":"IF(A299=0,\"\",COC!D312)","v":""},{"$f":"IF(A299=0,\"\",COC!E312)","v":""},{"$f":"IF(A299=0,\"\",COC!F312)","v":""},{"$f":"IF(A299=0,\"\",COC!G312)","v":""}]
[null,{"$f":"CONCATENATE(COC!A313,\"-\",COC!B290)","v":"-"},"",{"$f":"IF(A300=0,\"\",COC!C313)","v":""},{"$f":"IF(A300=0,\"\",COC!D313)","v":""},{"$f":"IF(A300=0,\"\",COC!E313)","v":""},{"$f":"IF(A300=0,\"\",COC!F313)","v":""},{"$f":"IF(A300=0,\"\",COC!G313)","v":""}]
[null,{"$f":"CONCATENATE(COC!A314,\"-\",COC!B291)","v":"-"},"",{"$f":"IF(A301=0,\"\",COC!C314)","v":""},{"$f":"IF(A301=0,\"\",COC!D314)","v":""},{"$f":"IF(A301=0,\"\",COC!E314)","v":""},{"$f":"IF(A301=0,\"\",COC!F314)","v":""},{"$f":"IF(A301=0,\"\",COC!G314)","v":""}]
[null,{"$f":"CONCATENATE(COC!A315,\"-\",COC!B292)","v":"-"},"",{"$f":"IF(A302=0,\"\",COC!C315)","v":""},{"$f":"IF(A302=0,\"\",COC!D315)","v":""},{"$f":"IF(A302=0,\"\",COC!E315)","v":""},{"$f":"IF(A302=0,\"\",COC!F315)","v":""},{"$f":"IF(A302=0,\"\",COC!G315)","v":""}]
[null,{"$f":"CONCATENATE(COC!A316,\"-\",COC!B293)","v":"-"},"",{"$f":"IF(A303=0,\"\",COC!C316)","v":""},{"$f":"IF(A303=0,\"\",COC!D316)","v":""},{"$f":"IF(A303=0,\"\",COC!E316)","v":""},{"$f":"IF(A303=0,\"\",COC!F316)","v":""},{"$f":"IF(A303=0,\"\",COC!G316)","v":""}]
[null,{"$f":"CONCATENATE(COC!A317,\"-\",COC!B294)","v":"-"},"",{"$f":"IF(A304=0,\"\",COC!C317)","v":""},{"$f":"IF(A304=0,\"\",COC!D317)","v":""},{"$f":"IF(A304=0,\"\",COC!E317)","v":""},{"$f":"IF(A304=0,\"\",COC!F317)","v":""},{"$f":"IF(A304=0,\"\",COC!G317)","v":""}]
[null,{"$f":"CONCATENATE(COC!A318,\"-\",COC!B295)","v":"-"},"",{"$f":"IF(A305=0,\"\",COC!C318)","v":""},{"$f":"IF(A305=0,\"\",COC!D318)","v":""},{"$f":"IF(A305=0,\"\",COC!E318)","v":""},{"$f":"IF(A305=0,\"\",COC!F318)","v":""},{"$f":"IF(A305=0,\"\",COC!G318)","v":""}]
[null,{"$f":"CONCATENATE(COC!A319,\"-\",COC!B296)","v":"-"},"",{"$f":"IF(A306=0,\"\",COC!C319)","v":""},{"$f":"IF(A306=0,\"\",COC!D319)","v":""},{"$f":"IF(A306=0,\"\",COC!E319)","v":""},{"$f":"IF(A306=0,\"\",COC!F319)","v":""},{"$f":"IF(A306=0,\"\",COC!G319)","v":""}]
[null,{"$f":"CONCATENATE(COC!A320,\"-\",COC!B297)","v":"-"},"",{"$f":"IF(A307=0,\"\",COC!C320)","v":""},{"$f":"IF(A307=0,\"\",COC!D320)","v":""},{"$f":"IF(A307=0,\"\",COC!E320)","v":""},{"$f":"IF(A307=0,\"\",COC!F320)","v":""},{"$f":"IF(A307=0,\"\",COC!G320)","v":""}]
[null,{"$f":"CONCATENATE(COC!A321,\"-\",COC!B298)","v":"-"},"",{"$f":"IF(A308=0,\"\",COC!C321)","v":""},{"$f":"IF(A308=0,\"\",COC!D321)","v":""},{"$f":"IF(A308=0,\"\",COC!E321)","v":""},{"$f":"IF(A308=0,\"\",COC!F321)","v":""},{"$f":"IF(A308=0,\"\",COC!G321)","v":""}]
[null,{"$f":"CONCATENATE(COC!A322,\"-\",COC!B299)","v":"-"},"",{"$f":"IF(A309=0,\"\",COC!C322)","v":""},{"$f":"IF(A309=0,\"\",COC!D322)","v":""},{"$f":"IF(A309=0,\"\",COC!E322)","v":""},{"$f":"IF(A309=0,\"\",COC!F322)","v":""},{"$f":"IF(A309=0,\"\",COC!G322)","v":""}]
[null,{"$f":"CONCATENATE(COC!A323,\"-\",COC!B300)","v":"-"},"",{"$f":"IF(A310=0,\"\",COC!C323)","v":""},{"$f":"IF(A310=0,\"\",COC!D323)","v":""},{"$f":"IF(A310=0,\"\",COC!E323)","v":""},{"$f":"IF(A310=0,\"\",COC!F323)","v":""},{"$f":"IF(A310=0,\"\",COC!G323)","v":""}]
[null,{"$f":"CONCATENATE(COC!A324,\"-\",COC!B301)","v":"-"},"",{"$f":"IF(A311=0,\"\",COC!C324)","v":""},{"$f":"IF(A311=0,\"\",COC!D324)","v":""},{"$f":"IF(A311=0,\"\",COC!E324)","v":""},{"$f":"IF(A311=0,\"\",COC!F324)","v":""},{"$f":"IF(A311=0,\"\",COC!G324)","v":""}]
[null,{"$f":"CONCATENATE(COC!A325,\"-\",COC!B302)","v":"-"},"",{"$f":"IF(A312=0,\"\",COC!C325)","v":""},{"$f":"IF(A312=0,\"\",COC!D325)","v":""},{"$f":"IF(A312=0,\"\",COC!E325)","v":""},{"$f":"IF(A312=0,\"\",COC!F325)","v":""},{"$f":"IF(A312=0,\"\",COC!G325)","v":""}]
[null,{"$f":"CONCATENATE(COC!A326,\"-\",COC!B303)","v":"-"},"",{"$f":"IF(A313=0,\"\",COC!C326)","v":""},{"$f":"IF(A313=0,\"\",COC!D326)","v":""},{"$f":"IF(A313=0,\"\",COC!E326)","v":""},{"$f":"IF(A313=0,\"\",COC!F326)","v":""},{"$f":"IF(A313=0,\"\",COC!G326)","v":""}]
[null,{"$f":"CONCATENATE(COC!A327,\"-\",COC!B304)","v":"-"},"",{"$f":"IF(A314=0,\"\",COC!C327)","v":""},{"$f":"IF(A314=0,\"\",COC!D327)","v":""},{"$f":"IF(A314=0,\"\",COC!E327)","v":""},{"$f":"IF(A314=0,\"\",COC!F327)","v":""},{"$f":"IF(A314=0,\"\",COC!G327)","v":""}]
[null,{"$f":"CONCATENATE(COC!A328,\"-\",COC!B305)","v":"-"},"",{"$f":"IF(A315=0,\"\",COC!C328)","v":""},{"$f":"IF(A315=0,\"\",COC!D328)","v":""},{"$f":"IF(A315=0,\"\",COC!E328)","v":""},{"$f":"IF(A315=0,\"\",COC!F328)","v":""},{"$f":"IF(A315=0,\"\",COC!G328)","v":""}]
[null,{"$f":"CONCATENATE(COC!A329,\"-\",COC!B306)","v":"-"},"",{"$f":"IF(A316=0,\"\",COC!C329)","v":""},{"$f":"IF(A316=0,\"\",COC!D329)","v":""},{"$f":"IF(A316=0,\"\",COC!E329)","v":""},{"$f":"IF(A316=0,\"\",COC!F329)","v":""},{"$f":"IF(A316=0,\"\",COC!G329)","v":""}]
[null,{"$f":"CONCATENATE(COC!A330,\"-\",COC!B307)","v":"-"},"",{"$f":"IF(A317=0,\"\",COC!C330)","v":""},{"$f":"IF(A317=0,\"\",COC!D330)","v":""},{"$f":"IF(A317=0,\"\",COC!E330)","v":""},{"$f":"IF(A317=0,\"\",COC!F330)","v":""},{"$f":"IF(A317=0,\"\",COC!G330)","v":""}]
[null,{"$f":"CONCATENATE(COC!A331,\"-\",COC!B308)","v":"-"},"",{"$f":"IF(A318=0,\"\",COC!C331)","v":""},{"$f":"IF(A318=0,\"\",COC!D331)","v":""},{"$f":"IF(A318=0,\"\",COC!E331)","v":""},{"$f":"IF(A318=0,\"\",COC!F331)","v":""},{"$f":"IF(A318=0,\"\",COC!G331)","v":""}]
[null,{"$f":"CONCATENATE(COC!A332,\"-\",COC!B309)","v":"-"},"",{"$f":"IF(A319=0,\"\",COC!C332)","v":""},{"$f":"IF(A319=0,\"\",COC!D332)","v":""},{"$f":"IF(A319=0,\"\",COC!E332)","v":""},{"$f":"IF(A319=0,\"\",COC!F332)","v":""},{"$f":"IF(A319=0,\"\",COC!G332)","v":""}]
[null,{"$f":"CONCATENATE(COC!A333,\"-\",COC!B310)","v":"-"},"",{"$f":"IF(A320=0,\"\",COC!C333)","v":""},{"$f":"IF(A320=0,\"\",COC!D333)","v":""},{"$f":"IF(A320=0,\"\",COC!E333)","v":""},{"$f":"IF(A320=0,\"\",COC!F333)","v":""},{"$f":"IF(A320=0,\"\",COC!G333)","v":""}]
[null,{"$f":"CONCATENATE(COC!A334,\"-\",COC!B311)","v":"-"},"",{"$f":"IF(A321=0,\"\",COC!C334)","v":""},{"$f":"IF(A321=0,\"\",COC!D334)","v":""},{"$f":"IF(A321=0,\"\",COC!E334)","v":""},{"$f":"IF(A321=0,\"\",COC!F334)","v":""},{"$f":"IF(A321=0,\"\",COC!G334)","v":""}]
[null,{"$f":"CONCATENATE(COC!A335,\"-\",COC!B312)","v":"-"},"",{"$f":"IF(A322=0,\"\",COC!C335)","v":""},{"$f":"IF(A322=0,\"\",COC!D335)","v":""},{"$f":"IF(A322=0,\"\",COC!E335)","v":""},{"$f":"IF(A322=0,\"\",COC!F335)","v":""},{"$f":"IF(A322=0,\"\",COC!G335)","v":""}]
[null,{"$f":"CONCATENATE(COC!A336,\"-\",COC!B313)","v":"-"},"",{"$f":"IF(A323=0,\"\",COC!C336)","v":""},{"$f":"IF(A323=0,\"\",COC!D336)","v":""},{"$f":"IF(A323=0,\"\",COC!E336)","v":""},{"$f":"IF(A323=0,\"\",COC!F336)","v":""},{"$f":"IF(A323=0,\"\",COC!G336)","v":""}]
[null,{"$f":"CONCATENATE(COC!A337,\"-\",COC!B314)","v":"-"},"",{"$f":"IF(A324=0,\"\",COC!C337)","v":""},{"$f":"IF(A324=0,\"\",COC!D337)","v":""},{"$f":"IF(A324=0,\"\",COC!E337)","v":""},{"$f":"IF(A324=0,\"\",COC!F337)","v":""},{"$f":"IF(A324=0,\"\",COC!G337)","v":""}]
[null,{"$f":"CONCATENATE(COC!A338,\"-\",COC!B315)","v":"-"},"",{"$f":"IF(A325=0,\"\",COC!C338)","v":""},{"$f":"IF(A325=0,\"\",COC!D338)","v":""},{"$f":"IF(A325=0,\"\",COC!E338)","v":""},{"$f":"IF(A325=0,\"\",COC!F338)","v":""},{"$f":"IF(A325=0,\"\",COC!G338)","v":""}]
[null,{"$f":"CONCATENATE(COC!A339,\"-\",COC!B316)","v":"-"},"",{"$f":"IF(A326=0,\"\",COC!C339)","v":""},{"$f":"IF(A326=0,\"\",COC!D339)","v":""},{"$f":"IF(A326=0,\"\",COC!E339)","v":""},{"$f":"IF(A326=0,\"\",COC!F339)","v":""},{"$f":"IF(A326=0,\"\",COC!G339)","v":""}]
[null,{"$f":"CONCATENATE(COC!A340,\"-\",COC!B317)","v":"-"},"",{"$f":"IF(A327=0,\"\",COC!C340)","v":""},{"$f":"IF(A327=0,\"\",COC!D340)","v":""},{"$f":"IF(A327=0,\"\",COC!E340)","v":""},{"$f":"IF(A327=0,\"\",COC!F340)","v":""},{"$f":"IF(A327=0,\"\",COC!G340)","v":""}]
[null,{"$f":"CONCATENATE(COC!A341,\"-\",COC!B318)","v":"-"},"",{"$f":"IF(A328=0,\"\",COC!C341)","v":""},{"$f":"IF(A328=0,\"\",COC!D341)","v":""},{"$f":"IF(A328=0,\"\",COC!E341)","v":""},{"$f":"IF(A328=0,\"\",COC!F341)","v":""},{"$f":"IF(A328=0,\"\",COC!G341)","v":""}]
[null,{"$f":"CONCATENATE(COC!A342,\"-\",COC!B319)","v":"-"},"",{"$f":"IF(A329=0,\"\",COC!C342)","v":""},{"$f":"IF(A329=0,\"\",COC!D342)","v":""},{"$f":"IF(A329=0,\"\",COC!E342)","v":""},{"$f":"IF(A329=0,\"\",COC!F342)","v":""},{"$f":"IF(A329=0,\"\",COC!G342)","v":""}]
[null,{"$f":"CONCATENATE(COC!A343,\"-\",COC!B320)","v":"-"},"",{"$f":"IF(A330=0,\"\",COC!C343)","v":""},{"$f":"IF(A330=0,\"\",COC!D343)","v":""},{"$f":"IF(A330=0,\"\",COC!E343)","v":""},{"$f":"IF(A330=0,\"\",COC!F343)","v":""},{"$f":"IF(A330=0,\"\",COC!G343)","v":""}]
[null,{"$f":"CONCATENATE(COC!A344,\"-\",COC!B321)","v":"-"},"",{"$f":"IF(A331=0,\"\",COC!C344)","v":""},{"$f":"IF(A331=0,\"\",COC!D344)","v":""},{"$f":"IF(A331=0,\"\",COC!E344)","v":""},{"$f":"IF(A331=0,\"\",COC!F344)","v":""},{"$f":"IF(A331=0,\"\",COC!G344)","v":""}]
[null,{"$f":"CONCATENATE(COC!A345,\"-\",COC!B322)","v":"-"},"",{"$f":"IF(A332=0,\"\",COC!C345)","v":""},{"$f":"IF(A332=0,\"\",COC!D345)","v":""},{"$f":"IF(A332=0,\"\",COC!E345)","v":""},{"$f":"IF(A332=0,\"\",COC!F345)","v":""},{"$f":"IF(A332=0,\"\",COC!G345)","v":""}]
[null,{"$f":"CONCATENATE(COC!A346,\"-\",COC!B323)","v":"-"},{"$f":"IF(A333=0,\"\",_xlfn.CONCAT($L$11,\"-\",A333))","v":""},{"$f":"IF(A333=0,\"\",COC!C346)","v":""},{"$f":"IF(A333=0,\"\",COC!D346)","v":""},{"$f":"IF(A333=0,\"\",COC!E346)","v":""},{"$f":"IF(A333=0,\"\",COC!F346)","v":""},{"$f":"IF(A333=0,\"\",COC!G346)","v":""}]
[null,{"$f":"CONCATENATE(COC!A347,\"-\",COC!B324)","v":"-"},"",{"$f":"IF(A334=0,\"\",COC!C347)","v":""},{"$f":"IF(A334=0,\"\",COC!D347)","v":""},{"$f":"IF(A334=0,\"\",COC!E347)","v":""},{"$f":"IF(A334=0,\"\",COC!F347)","v":""},{"$f":"IF(A334=0,\"\",COC!G347)","v":""}]
[null,{"$f":"CONCATENATE(COC!A348,\"-\",COC!B325)","v":"-"},"",{"$f":"IF(A335=0,\"\",COC!C348)","v":""},{"$f":"IF(A335=0,\"\",COC!D348)","v":""},{"$f":"IF(A335=0,\"\",COC!E348)","v":""},{"$f":"IF(A335=0,\"\",COC!F348)","v":""},{"$f":"IF(A335=0,\"\",COC!G348)","v":""}]
[null,{"$f":"CONCATENATE(COC!A349,\"-\",COC!B326)","v":"-"},"",{"$f":"IF(A336=0,\"\",COC!C349)","v":""},{"$f":"IF(A336=0,\"\",COC!D349)","v":""},{"$f":"IF(A336=0,\"\",COC!E349)","v":""},{"$f":"IF(A336=0,\"\",COC!F349)","v":""},{"$f":"IF(A336=0,\"\",COC!G349)","v":""}]
[null,{"$f":"CONCATENATE(COC!A350,\"-\",COC!B327)","v":"-"},"",{"$f":"IF(A337=0,\"\",COC!C350)","v":""},{"$f":"IF(A337=0,\"\",COC!D350)","v":""},{"$f":"IF(A337=0,\"\",COC!E350)","v":""},{"$f":"IF(A337=0,\"\",COC!F350)","v":""},{"$f":"IF(A337=0,\"\",COC!G350)","v":""}]
[null,{"$f":"CONCATENATE(COC!A351,\"-\",COC!B328)","v":"-"},"",{"$f":"IF(A338=0,\"\",COC!C351)","v":""},{"$f":"IF(A338=0,\"\",COC!D351)","v":""},{"$f":"IF(A338=0,\"\",COC!E351)","v":""},{"$f":"IF(A338=0,\"\",COC!F351)","v":""},{"$f":"IF(A338=0,\"\",COC!G351)","v":""}]
[null,{"$f":"CONCATENATE(COC!A352,\"-\",COC!B329)","v":"-"},"",{"$f":"IF(A339=0,\"\",COC!C352)","v":""},{"$f":"IF(A339=0,\"\",COC!D352)","v":""},{"$f":"IF(A339=0,\"\",COC!E352)","v":""},{"$f":"IF(A339=0,\"\",COC!F352)","v":""},{"$f":"IF(A339=0,\"\",COC!G352)","v":""}]
[null,{"$f":"CONCATENATE(COC!A353,\"-\",COC!B330)","v":"-"},"",{"$f":"IF(A340=0,\"\",COC!C353)","v":""},{"$f":"IF(A340=0,\"\",COC!D353)","v":""},{"$f":"IF(A340=0,\"\",COC!E353)","v":""},{"$f":"IF(A340=0,\"\",COC!F353)","v":""},{"$f":"IF(A340=0,\"\",COC!G353)","v":""}]
[null,{"$f":"CONCATENATE(COC!A354,\"-\",COC!B331)","v":"-"},"",{"$f":"IF(A341=0,\"\",COC!C354)","v":""},{"$f":"IF(A341=0,\"\",COC!D354)","v":""},{"$f":"IF(A341=0,\"\",COC!E354)","v":""},{"$f":"IF(A341=0,\"\",COC!F354)","v":""},{"$f":"IF(A341=0,\"\",COC!G354)","v":""}]
[null,{"$f":"CONCATENATE(COC!A355,\"-\",COC!B332)","v":"-"},"",{"$f":"IF(A342=0,\"\",COC!C355)","v":""},{"$f":"IF(A342=0,\"\",COC!D355)","v":""},{"$f":"IF(A342=0,\"\",COC!E355)","v":""},{"$f":"IF(A342=0,\"\",COC!F355)","v":""},{"$f":"IF(A342=0,\"\",COC!G355)","v":""}]
[null,{"$f":"CONCATENATE(COC!A356,\"-\",COC!B333)","v":"-"},"",{"$f":"IF(A343=0,\"\",COC!C356)","v":""},{"$f":"IF(A343=0,\"\",COC!D356)","v":""},{"$f":"IF(A343=0,\"\",COC!E356)","v":""},{"$f":"IF(A343=0,\"\",COC!F356)","v":""},{"$f":"IF(A343=0,\"\",COC!G356)","v":""}]
[null,{"$f":"CONCATENATE(COC!A357,\"-\",COC!B334)","v":"-"},"",{"$f":"IF(A344=0,\"\",COC!C357)","v":""},{"$f":"IF(A344=0,\"\",COC!D357)","v":""},{"$f":"IF(A344=0,\"\",COC!E357)","v":""},{"$f":"IF(A344=0,\"\",COC!F357)","v":""},{"$f":"IF(A344=0,\"\",COC!G357)","v":""}]
[null,{"$f":"CONCATENATE(COC!A358,\"-\",COC!B335)","v":"-"},"",{"$f":"IF(A345=0,\"\",COC!C358)","v":""},{"$f":"IF(A345=0,\"\",COC!D358)","v":""},{"$f":"IF(A345=0,\"\",COC!E358)","v":""},{"$f":"IF(A345=0,\"\",COC!F358)","v":""},{"$f":"IF(A345=0,\"\",COC!G358)","v":""}]
[null,{"$f":"CONCATENATE(COC!A359,\"-\",COC!B336)","v":"-"},"",{"$f":"IF(A346=0,\"\",COC!C359)","v":""},{"$f":"IF(A346=0,\"\",COC!D359)","v":""},{"$f":"IF(A346=0,\"\",COC!E359)","v":""},{"$f":"IF(A346=0,\"\",COC!F359)","v":""},{"$f":"IF(A346=0,\"\",COC!G359)","v":""}]

{"sheet":"Gravimetría","index":2,"n_rows":69,"n_cols":13,"rows_kept":69,"cut":false,"hidden":true,"merged":[[0,0,2,8],[3,1,3,8],[4,2,4,3],[4,4,4,5],[5,2,5,3],[5,4,5,5],[11,1,13,1],[12,4,13,4],[12,6,13,6],[12,8,13,8],[6,2,6,8],[7,1,7,8],[8,1,9,1],[8,3,13,3],[8,4,9,4],[8,5,13,5],[8,6,9,6],[8,7,13,7],[8,8,9,8],[10,4,11,4],[16,6,17,6],[16,7,17,7],[15,8,17,8],[10,6,11,6],[10,8,11,8],[20,7,39,7],[41,1,45,1],[47,4,47,6],[48,2,48,4],[48,6,48,8],[60,2,60,4],[60,6,60,8],[61,1,67,1],[61,2,67,8],[13,11,15,11],[14,1,17,1],[14,2,15,2],[14,3,15,3],[14,6,15,6],[14,7,15,7],[49,2,49,4],[49,6,49,8],[50,1,57,1],[50,2,57,8],[59,2,59,4],[59,6,59,8]]}
["Formato de analisis IH"]
[]
[]
[null,"Recepción de muestra"]
[null,"Movimiento",{"$f":"IF(COC!B4=0,\"\",COC!B4)","v":""},null,"Custodia",null,{"$f":"IF(COC!B4=0,\"\",COC!D4)","v":""},"Informe",{"$f":"IF(COC!B4=0,\"\",COC!F4)","v":""}]
[null,"Cantidad",{"$f":"IF(COC!B4=0,\"\",COC!B17)","v":""},null,"Fecha de recepción",null,{"$f":"IF(COC!B4=0,\"\",COC!B53)","v":""},"Hora ",{"$f":"IF(COC!$D$4=0,\"\",COC!E53)","v":""}]
[null,"Observaciones",{"$f":"IF(AND(COC!B55=0,COC!B20=0),\"Sin observaciones\",_xlfn.CONCAT(COC!B20,\"-\",COC!B55))","v":"Sin observaciones"}]
[null,"Análisis de muestras",null,null,"Analisis de las muestras"]
[null,"Balanza ID",null,"Verificación",null,"Fecha",null,"Realizó"]
[]
[null,"Masas  ID"]
[null,"Masas (mg)"]
[]
[]
[null,"Controles","Descarga de datos condiciones ",false,"Código Blanco de laboratorio ",null,"Cartas control ",null,"Códigos verificados (10%)"]
[null,null,null,null,"Peso Blanco de laboratorio "]
[null,null,null,false,"Código filtro  enriquecido ",null,"Revisón Cartas Control "]
[null,null,"Revisión de datos condiciones ",false,"Peso filtro enriquecido"]
[]
["#","ID Laboratorio","Análisis","Método","Medio ","Masa","Unidad","Fecha","Bk",null,null,null,"unidades"]
[1,{"$f":"IF(COC!A25=0,\"\",COC!A25)","v":""},{"$f":"IF(COC!A25=0,\"\",COC!E25)","v":""},{"$f":"IF(COC!A25=0,\"\",COC!D25)","v":""},{"$f":"IF(COC!A25=0,\"\",COC!F25)","v":""},null,{"$f":"IF(COUNTBLANK(B21)>=1,\"\",IF(AND(E21=\"F. PVC 25 mm PW, 5 µm - IOM\",C21=\"Fracción inhalable\"),\"mg\",\"µg\"))","v":""},null,false,null,1,null,"µg"]
[2,{"$f":"IF(COC!A26=0,\"\",COC!A26)","v":""},{"$f":"IF(COC!A26=0,\"\",COC!E26)","v":""},{"$f":"IF(COC!A26=0,\"\",COC!D26)","v":""},{"$f":"IF(COC!A26=0,\"\",COC!F26)","v":""},null,{"$f":"IF(COUNTBLANK(B22)>=1,\"\",IF(AND(E22=\"F. PVC 25 mm PW, 5 µm - IOM\",C22=\"Fracción inhalable\"),\"mg\",\"µg\"))","v":""},null,false,null,2,null,"mg"]
[3,{"$f":"IF(COC!A27=0,\"\",COC!A27)","v":""},{"$f":"IF(COC!A27=0,\"\",COC!E27)","v":""},{"$f":"IF(COC!A27=0,\"\",COC!D27)","v":""},{"$f":"IF(COC!A27=0,\"\",COC!F27)","v":""},null,"",null,false,null,3,null,"g"]
[4,{"$f":"IF(COC!A28=0,\"\",COC!A28)","v":""},{"$f":"IF(COC!A28=0,\"\",COC!E28)","v":""},{"$f":"IF(COC!A28=0,\"\",COC!D28)","v":""},{"$f":"IF(COC!A28=0,\"\",COC!F28)","v":""},null,"",null,false,null,4,null,"kg"]
[5,{"$f":"IF(COC!A29=0,\"\",COC!A29)","v":""},{"$f":"IF(COC!A29=0,\"\",COC!E29)","v":""},{"$f":"IF(COC!A29=0,\"\",COC!D29)","v":""},{"$f":"IF(COC!A29=0,\"\",COC!F29)","v":""},null,"",null,false,null,5]
[6,{"$f":"IF(COC!A30=0,\"\",COC!A30)","v":""},{"$f":"IF(COC!A30=0,\"\",COC!E30)","v":""},{"$f":"IF(COC!A30=0,\"\",COC!D30)","v":""},{"$f":"IF(COC!A30=0,\"\",COC!F30)","v":""},null,"",null,false,null,6]
[7,{"$f":"IF(COC!A31=0,\"\",COC!A31)","v":""},{"$f":"IF(COC!A31=0,\"\",COC!E31)","v":""},{"$f":"IF(COC!A31=0,\"\",COC!D31)","v":""},{"$f":"IF(COC!A31=0,\"\",COC!F31)","v":""},null,"",null,false,null,7]
[8,{"$f":"IF(COC!A32=0,\"\",COC!A32)","v":""},{"$f":"IF(COC!A32=0,\"\",COC!E32)","v":""},{"$f":"IF(COC!A32=0,\"\",COC!D32)","v":""},{"$f":"IF(COC!A32=0,\"\",COC!F32)","v":""},null,"",null,false,null,8]
[9,{"$f":"IF(COC!A33=0,\"\",COC!A33)","v":""},{"$f":"IF(COC!A33=0,\"\",COC!E33)","v":""},{"$f":"IF(COC!A33=0,\"\",COC!D33)","v":""},{"$f":"IF(COC!A33=0,\"\",COC!F33)","v":""},null,"",null,false,null,9]
[10,{"$f":"IF(COC!A34=0,\"\",COC!A34)","v":""},{"$f":"IF(COC!A34=0,\"\",COC!E34)","v":""},{"$f":"IF(COC!A34=0,\"\",COC!D34)","v":""},{"$f":"IF(COC!A34=0,\"\",COC!F34)","v":""},null,"",null,false,null,10]
[11,{"$f":"IF(COC!A35=0,\"\",COC!A35)","v":""},{"$f":"IF(COC!A35=0,\"\",COC!E35)","v":""},{"$f":"IF(COC!A35=0,\"\",COC!D35)","v":""},{"$f":"IF(COC!A35=0,\"\",COC!F35)","v":""},null,"",null,false,null,11]
[12,{"$f":"IF(COC!A36=0,\"\",COC!A36)","v":""},{"$f":"IF(COC!A36=0,\"\",COC!E36)","v":""},{"$f":"IF(COC!A36=0,\"\",COC!D36)","v":""},{"$f":"IF(COC!A36=0,\"\",COC!F36)","v":""},null,"",null,false,null,12]
[13,{"$f":"IF(COC!A37=0,\"\",COC!A37)","v":""},{"$f":"IF(COC!A37=0,\"\",COC!E37)","v":""},{"$f":"IF(COC!A37=0,\"\",COC!D37)","v":""},{"$f":"IF(COC!A37=0,\"\",COC!F37)","v":""},null,"",null,false,null,13]
[14,{"$f":"IF(COC!A38=0,\"\",COC!A38)","v":""},{"$f":"IF(COC!A38=0,\"\",COC!E38)","v":""},{"$f":"IF(COC!A38=0,\"\",COC!D38)","v":""},{"$f":"IF(COC!A38=0,\"\",COC!F38)","v":""},null,"",null,false,null,14]
[15,{"$f":"IF(COC!A39=0,\"\",COC!A39)","v":""},{"$f":"IF(COC!A39=0,\"\",COC!E39)","v":""},{"$f":"IF(COC!A39=0,\"\",COC!D39)","v":""},{"$f":"IF(COC!A39=0,\"\",COC!F39)","v":""},null,"",null,false,null,15]
[16,{"$f":"IF(COC!A40=0,\"\",COC!A40)","v":""},{"$f":"IF(COC!A40=0,\"\",COC!E40)","v":""},{"$f":"IF(COC!A40=0,\"\",COC!D40)","v":""},{"$f":"IF(COC!A40=0,\"\",COC!F40)","v":""},null,"",null,false,null,16]
[17,{"$f":"IF(COC!A41=0,\"\",COC!A41)","v":""},{"$f":"IF(COC!A41=0,\"\",COC!E41)","v":""},{"$f":"IF(COC!A41=0,\"\",COC!D41)","v":""},{"$f":"IF(COC!A41=0,\"\",COC!F41)","v":""},null,"",null,false,null,17]
[18,{"$f":"IF(COC!A42=0,\"\",COC!A42)","v":""},{"$f":"IF(COC!A42=0,\"\",COC!E42)","v":""},{"$f":"IF(COC!A42=0,\"\",COC!D42)","v":""},{"$f":"IF(COC!A42=0,\"\",COC!F42)","v":""},null,"",null,false,null,18]
[19,{"$f":"IF(COC!A43=0,\"\",COC!A43)","v":""},{"$f":"IF(COC!A43=0,\"\",COC!E43)","v":""},{"$f":"IF(COC!A43=0,\"\",COC!D43)","v":""},{"$f":"IF(COC!A43=0,\"\",COC!F43)","v":""},null,"",null,false,null,19]
[20,{"$f":"IF(COC!A44=0,\"\",COC!A44)","v":""},{"$f":"IF(COC!A44=0,\"\",COC!E44)","v":""},{"$f":"IF(COC!A44=0,\"\",COC!D44)","v":""},{"$f":"IF(COC!A44=0,\"\",COC!F44)","v":""},null,"",null,false,null,20]
[]
[null,"Observaciones/ Novedades"]
[]
[]
[]
[]
[]
[null,null,null,null,"Informe de resultados"]
[null,"Realizó",null,null,null,"Revisó 1"]
[null,"Fecha",null,null,null,"Fecha"]
[null,"Observaciones"]
[]
[]
[]
[]
[]
[]
[]
[]
[null,"Realizó",null,null,null,"Revisó 2"]
[null,"Fecha",null,null,null,"Fecha"]
[null,"Observaciones"]
[]
[]
[]
[]
[]
[]
[null,null,"Incidencia"]

{"sheet":"Espectrofotometría","index":3,"n_rows":69,"n_cols":14,"rows_kept":69,"cut":false,"hidden":true,"merged":[[0,0,2,9],[4,3,4,4],[5,3,5,4],[6,2,6,7],[61,1,67,1],[61,2,67,8],[13,1,18,1],[42,1,46,1],[48,4,48,6],[49,2,49,4],[49,6,49,8],[21,7,40,7],[21,5,40,5],[21,6,40,6],[50,2,50,4],[50,6,50,8],[59,2,59,4],[59,6,59,8],[60,2,60,4],[60,6,60,8],[51,1,57,1],[51,2,57,8],[8,1,9,1],[10,1,11,1],[13,4,14,4],[10,6,11,6],[10,7,11,7],[15,4,16,4],[13,5,14,5],[15,5,16,5],[10,3,10,5],[11,3,11,5],[12,3,12,5],[8,2,8,3],[8,4,8,7],[9,2,9,3]]}
["Formato de analisis IH"]
[]
[]
[null,"Recepción de muestra"]
[null,"Movimiento",{"$f":"IF(COC!B4=0,\"\",COC!B4)","v":""},"Custodia",null,{"$f":"IF(COC!B4=0,\"\",COC!D4)","v":""},"Informe",{"$f":"IF(COC!B4=0,\"\",COC!F4)","v":""}]
[null,"Cantidad",{"$f":"IF(COC!B4=0,\"\",COC!B17)","v":""},"Fecha de recepción",null,{"$f":"IF(COC!B4=0,\"\",COC!B53)","v":""},"Hora ",{"$f":"IF(COC!$D$4=0,\"\",COC!E53)","v":""}]
[null,"Observaciones",{"$f":"IF(AND(COC!B55=0,COC!B20=0),\"Sin observaciones\",_xlfn.CONCAT(COC!B20,\"-\",COC!B55))","v":"Sin observaciones"}]
[null,"Análisis de muestras",null,null,"Analisis de las muestras"]
[null,"Equipo","CI "]
[null,null,"Almacenamiento",null,null,null,"Refrigeración"]
[null,"Pretratamiento","Responsable digestión",null,null,null,"Lote solución oxisulfato de titanio "]
[null,null,"Responsable filtración"]
[null,"Análisis de muestras","Responsable",null,null,null,"Fecha curva utilizada"]
[null,"Controles","Código MB",null,"Código solución madre curva ",null,"Lote de reactivo "]
[null,null,"Código LCSB",null,null,null,"Marca reactivo "]
[null,null,"Código LCSM",null,"Código solución madre controles  ",null,"Lote de reactivo "]
[null,null,"Código LCSA",null,null,null,"Marca reactivo "]
[null,null,"ICV",null,"Diligenciamiento reactivos ",null,"Carta control ",false]
[null,null,"Códigos verificados (10%)",null,"Código relectura de muestra",null,"Revisión carta control ",false]
[]
["#","ID Laboratorio","Análisis","Método","Medio ","Fecha de digestión ","Fecha de filtración ","Fecha de análisis","Bk",null,null,null,null,"unidades"]
[1,{"$f":"IF(COC!A25=0,\"\",COC!A25)","v":""},{"$f":"IF(COC!A25=0,\"\",COC!E25)","v":""},{"$f":"IF(COC!A25=0,\"\",COC!D25)","v":""},{"$f":"IF(COC!A25=0,\"\",COC!F25)","v":""},null,null,null,false,null,null,1,null,"µg"]
[2,{"$f":"IF(COC!A27=0,\"\",COC!A26)","v":""},{"$f":"IF(COC!A26=0,\"\",COC!E26)","v":""},{"$f":"IF(COC!A26=0,\"\",COC!D26)","v":""},{"$f":"IF(COC!A26=0,\"\",COC!F26)","v":""},null,null,null,false,null,null,2,null,"mg"]
[3,{"$f":"IF(COC!A28=0,\"\",COC!A27)","v":""},{"$f":"IF(COC!A27=0,\"\",COC!E27)","v":""},{"$f":"IF(COC!A27=0,\"\",COC!D27)","v":""},{"$f":"IF(COC!A27=0,\"\",COC!F27)","v":""},null,null,null,false,null,null,3,null,"g"]
[4,{"$f":"IF(COC!A29=0,\"\",COC!A28)","v":""},{"$f":"IF(COC!A28=0,\"\",COC!E28)","v":""},{"$f":"IF(COC!A28=0,\"\",COC!D28)","v":""},{"$f":"IF(COC!A28=0,\"\",COC!F28)","v":""},null,null,null,false,null,null,4,null,"kg"]
[5,{"$f":"IF(COC!A30=0,\"\",COC!A29)","v":""},{"$f":"IF(COC!A29=0,\"\",COC!E29)","v":""},{"$f":"IF(COC!A29=0,\"\",COC!D29)","v":""},{"$f":"IF(COC!A29=0,\"\",COC!F29)","v":""},null,null,null,false,null,null,5]
[6,{"$f":"IF(COC!A31=0,\"\",COC!A30)","v":""},{"$f":"IF(COC!A30=0,\"\",COC!E30)","v":""},{"$f":"IF(COC!A30=0,\"\",COC!D30)","v":""},{"$f":"IF(COC!A30=0,\"\",COC!F30)","v":""},null,null,null,false,null,null,6]
[7,{"$f":"IF(COC!A32=0,\"\",COC!A31)","v":""},{"$f":"IF(COC!A31=0,\"\",COC!E31)","v":""},{"$f":"IF(COC!A31=0,\"\",COC!D31)","v":""},{"$f":"IF(COC!A31=0,\"\",COC!F31)","v":""},null,null,null,false,null,null,7]
[8,{"$f":"IF(COC!A33=0,\"\",COC!A32)","v":""},{"$f":"IF(COC!A32=0,\"\",COC!E32)","v":""},{"$f":"IF(COC!A32=0,\"\",COC!D32)","v":""},{"$f":"IF(COC!A32=0,\"\",COC!F32)","v":""},null,null,null,false,null,null,8]
[9,{"$f":"IF(COC!A34=0,\"\",COC!A33)","v":""},{"$f":"IF(COC!A33=0,\"\",COC!E33)","v":""},{"$f":"IF(COC!A33=0,\"\",COC!D33)","v":""},{"$f":"IF(COC!A33=0,\"\",COC!F33)","v":""},null,null,null,false,null,null,9]
[10,{"$f":"IF(COC!A35=0,\"\",COC!A34)","v":""},{"$f":"IF(COC!A34=0,\"\",COC!E34)","v":""},{"$f":"IF(COC!A34=0,\"\",COC!D34)","v":""},{"$f":"IF(COC!A34=0,\"\",COC!F34)","v":""},null,null,null,false,null,null,10]
[11,{"$f":"IF(COC!A36=0,\"\",COC!A35)","v":""},{"$f":"IF(COC!A35=0,\"\",COC!E35)","v":""},{"$f":"IF(COC!A35=0,\"\",COC!D35)","v":""},{"$f":"IF(COC!A35=0,\"\",COC!F35)","v":""},null,null,null,false,null,null,11]
[12,{"$f":"IF(COC!A37=0,\"\",COC!A36)","v":""},{"$f":"IF(COC!A36=0,\"\",COC!E36)","v":""},{"$f":"IF(COC!A36=0,\"\",COC!D36)","v":""},{"$f":"IF(COC!A36=0,\"\",COC!F36)","v":""},null,null,null,false,null,null,12]
[13,{"$f":"IF(COC!A38=0,\"\",COC!A37)","v":""},{"$f":"IF(COC!A37=0,\"\",COC!E37)","v":""},{"$f":"IF(COC!A37=0,\"\",COC!D37)","v":""},{"$f":"IF(COC!A37=0,\"\",COC!F37)","v":""},null,null,null,false,null,null,13]
[14,{"$f":"IF(COC!A39=0,\"\",COC!A38)","v":""},{"$f":"IF(COC!A38=0,\"\",COC!E38)","v":""},{"$f":"IF(COC!A38=0,\"\",COC!D38)","v":""},{"$f":"IF(COC!A38=0,\"\",COC!F38)","v":""},null,null,null,false,null,null,14]
[15,{"$f":"IF(COC!A40=0,\"\",COC!A39)","v":""},{"$f":"IF(COC!A39=0,\"\",COC!E39)","v":""},{"$f":"IF(COC!A39=0,\"\",COC!D39)","v":""},{"$f":"IF(COC!A39=0,\"\",COC!F39)","v":""},null,null,null,false,null,null,15]
[16,{"$f":"IF(COC!A41=0,\"\",COC!A40)","v":""},{"$f":"IF(COC!A40=0,\"\",COC!E40)","v":""},{"$f":"IF(COC!A40=0,\"\",COC!D40)","v":""},{"$f":"IF(COC!A40=0,\"\",COC!F40)","v":""},null,null,null,false,null,null,16]
[17,{"$f":"IF(COC!A42=0,\"\",COC!A41)","v":""},{"$f":"IF(COC!A41=0,\"\",COC!E41)","v":""},{"$f":"IF(COC!A41=0,\"\",COC!D41)","v":""},{"$f":"IF(COC!A41=0,\"\",COC!F41)","v":""},null,null,null,false,null,null,17]
[18,{"$f":"IF(COC!A43=0,\"\",COC!A42)","v":""},{"$f":"IF(COC!A42=0,\"\",COC!E42)","v":""},{"$f":"IF(COC!A42=0,\"\",COC!D42)","v":""},{"$f":"IF(COC!A42=0,\"\",COC!F42)","v":""},null,null,null,false,null,null,18]
[19,{"$f":"IF(COC!A44=0,\"\",COC!A43)","v":""},{"$f":"IF(COC!A43=0,\"\",COC!E43)","v":""},{"$f":"IF(COC!A43=0,\"\",COC!D43)","v":""},{"$f":"IF(COC!A43=0,\"\",COC!F43)","v":""},null,null,null,false,null,null,19]
[20,{"$f":"IF(COC!A45=0,\"\",COC!A44)","v":""},{"$f":"IF(COC!A44=0,\"\",COC!E44)","v":""},{"$f":"IF(COC!A44=0,\"\",COC!D44)","v":""},{"$f":"IF(COC!A44=0,\"\",COC!F44)","v":""},null,null,null,false,null,null,20]
[]
[null,"Observaciones/ Novedades"]
[]
[]
[]
[]
[]
[null,null,null,null,"Informe de resultados"]
[null,"Realizó",null,null,null,"Revisó 1"]
[null,"Fecha",null,null,null,"Fecha"]
[null,"Observaciones"]
[]
[]
[]
[]
[]
[]
[]
[null,"Realizó",null,null,null,"Revisó 2"]
[null,"Fecha",null,null,null,"Fecha"]
[null,"Observaciones"]
[]
[]
[]
[]
[]
[]
[null,null,"Incidencia"]

{"sheet":"Titulación","index":4,"n_rows":70,"n_cols":13,"rows_kept":70,"cut":false,"hidden":true,"merged":[[61,2,61,4],[61,6,61,8],[62,1,68,1],[62,2,68,8],[52,1,58,1],[52,2,58,8],[59,3,59,4],[59,5,59,6],[59,7,59,8],[60,2,60,4],[60,6,60,8],[51,2,51,4],[51,6,51,8],[38,1,39,1],[43,1,47,1],[49,4,49,6],[50,2,50,4],[50,6,50,8],[10,1,13,1],[5,2,5,3],[5,4,5,5],[5,8,5,9],[0,0,2,9],[3,1,3,9],[4,2,4,3],[4,4,4,5],[4,8,4,9],[6,2,6,9],[7,1,7,9]]}
["Formato de analisis IH"]
[]
[]
[null,"Recepción de muestra"]
[null,"Movimiento",{"$f":"IF(COC!B4=0,\"\",COC!B4)","v":""},null,"Custodia",null,{"$f":"IF(COC!B4=0,\"\",COC!D4)","v":""},"Informe",{"$f":"IF(COC!B4=0,\"\",COC!F4)","v":""}]
[null,"Cantidad",{"$f":"IF(COC!B4=0,\"\",COC!B17)","v":""},null,"Fecha de recepción",null,{"$f":"IF(COC!B4=0,\"\",COC!B53)","v":""},"Hora ",{"$f":"IF(COC!$D$4=0,\"\",COC!E53)","v":""}]
[null,"Observaciones",{"$f":"IF(AND(COC!B55=0,COC!B20=0),\"Sin observaciones\",_xlfn.CONCAT(COC!B20,\"-\",COC!B55))","v":"Sin observaciones"}]
[null,"Análisis de muestras"]
[null,"Estandarización ","Código HCl",null,null,null,"Código NaOH"]
[null,"Análisis de muestras","Fecha de análisis",null,"Realizó",null,"CI Equipo",null,"Calibración pH-metro",false]
[null,"Controles","Código MB",null,"Volumen gastado NaOH (mL)",null,"pH final ",null,"Carta control ","N.A"]
[null,null,"Código LCSB",null,"Volumen gastado NaOH (mL)",null,"pH final ",null,"Carta control ",false]
[null,null,"Código LCSM",null,"Volumen gastado NaOH (mL)",null,"pH final ",null,"Carta control ",false]
[null,null,"Código LCSA",null,"Volumen gastado NaOH (mL)",null,"pH final ",null,"Carta control ",false]
[null,"Revisión ","Estandarización reactivos",false,"Carta control ",false,"Verificación calibración",false,"Verificación Spike",false]
[]
[null,"#","ID Laboratorio","Análisis","Método","pH inicial","pH final","Volumen gastado NaOH (mL)","Bk",null,null,null,"unidades"]
[null,1,{"$f":"IF(COC!A25=0,\"\",COC!A25)","v":""},{"$f":"IF(COC!A25=0,\"\",COC!E25)","v":""},{"$f":"IF(COC!A25=0,\"\",COC!D25)","v":""},null,null,null,false,null,null,null,"µg"]
[null,2,{"$f":"IF(COC!A26=0,\"\",COC!A26)","v":""},{"$f":"IF(COC!A26=0,\"\",COC!E26)","v":""},{"$f":"IF(COC!A26=0,\"\",COC!D26)","v":""},null,null,null,false,null,null,null,"mg"]
[null,3,{"$f":"IF(COC!A27=0,\"\",COC!A27)","v":""},{"$f":"IF(COC!A27=0,\"\",COC!E27)","v":""},{"$f":"IF(COC!A27=0,\"\",COC!D27)","v":""},null,null,null,false,null,null,null,"g"]
[null,4,{"$f":"IF(COC!A28=0,\"\",COC!A28)","v":""},{"$f":"IF(COC!A28=0,\"\",COC!E28)","v":""},{"$f":"IF(COC!A28=0,\"\",COC!D28)","v":""},null,null,null,false,null,null,null,"kg"]
[null,5,{"$f":"IF(COC!A29=0,\"\",COC!A29)","v":""},{"$f":"IF(COC!A29=0,\"\",COC!E29)","v":""},{"$f":"IF(COC!A29=0,\"\",COC!D29)","v":""},null,null,null,false]
[null,6,{"$f":"IF(COC!A30=0,\"\",COC!A30)","v":""},{"$f":"IF(COC!A30=0,\"\",COC!E30)","v":""},{"$f":"IF(COC!A30=0,\"\",COC!D30)","v":""},null,null,null,false]
[null,7,{"$f":"IF(COC!A31=0,\"\",COC!A31)","v":""},{"$f":"IF(COC!A31=0,\"\",COC!E31)","v":""},{"$f":"IF(COC!A31=0,\"\",COC!D31)","v":""},null,null,null,false]
[null,8,{"$f":"IF(COC!A32=0,\"\",COC!A32)","v":""},{"$f":"IF(COC!A32=0,\"\",COC!E32)","v":""},{"$f":"IF(COC!A32=0,\"\",COC!D32)","v":""},null,null,null,false]
[null,9,{"$f":"IF(COC!A33=0,\"\",COC!A33)","v":""},{"$f":"IF(COC!A33=0,\"\",COC!E33)","v":""},{"$f":"IF(COC!A33=0,\"\",COC!D33)","v":""},null,null,null,false]
[null,10,{"$f":"IF(COC!A34=0,\"\",COC!A34)","v":""},{"$f":"IF(COC!A34=0,\"\",COC!E34)","v":""},{"$f":"IF(COC!A34=0,\"\",COC!D34)","v":""},null,null,null,false]
[null,11,{"$f":"IF(COC!A35=0,\"\",COC!A35)","v":""},{"$f":"IF(COC!A35=0,\"\",COC!E35)","v":""},{"$f":"IF(COC!A35=0,\"\",COC!D35)","v":""},null,null,null,false]
[null,12,{"$f":"IF(COC!A36=0,\"\",COC!A36)","v":""},{"$f":"IF(COC!A36=0,\"\",COC!E36)","v":""},{"$f":"IF(COC!A36=0,\"\",COC!D36)","v":""},null,null,null,false]
[null,13,{"$f":"IF(COC!A37=0,\"\",COC!A37)","v":""},{"$f":"IF(COC!A37=0,\"\",COC!E37)","v":""},{"$f":"IF(COC!A37=0,\"\",COC!D37)","v":""},null,null,null,false]
[null,14,{"$f":"IF(COC!A38=0,\"\",COC!A38)","v":""},{"$f":"IF(COC!A38=0,\"\",COC!E38)","v":""},{"$f":"IF(COC!A38=0,\"\",COC!D38)","v":""},null,null,null,false]
[null,15,{"$f":"IF(COC!A39=0,\"\",COC!A39)","v":""},{"$f":"IF(COC!A39=0,\"\",COC!E39)","v":""},{"$f":"IF(COC!A39=0,\"\",COC!D39)","v":""},null,null,null,false]
[null,16,{"$f":"IF(COC!A40=0,\"\",COC!A40)","v":""},{"$f":"IF(COC!A40=0,\"\",COC!E40)","v":""},{"$f":"IF(COC!A40=0,\"\",COC!D40)","v":""},null,null,null,false]
[null,17,{"$f":"IF(COC!A41=0,\"\",COC!A41)","v":""},{"$f":"IF(COC!A41=0,\"\",COC!E41)","v":""},{"$f":"IF(COC!A41=0,\"\",COC!D41)","v":""},null,null,null,false]
[null,18,{"$f":"IF(COC!A42=0,\"\",COC!A42)","v":""},{"$f":"IF(COC!A42=0,\"\",COC!E42)","v":""},{"$f":"IF(COC!A42=0,\"\",COC!D42)","v":""},null,null,null,false]
[null,19,{"$f":"IF(COC!A43=0,\"\",COC!A43)","v":""},{"$f":"IF(COC!A43=0,\"\",COC!E43)","v":""},{"$f":"IF(COC!A43=0,\"\",COC!D43)","v":""},null,null,null,false]
[null,20,{"$f":"IF(COC!A44=0,\"\",COC!A44)","v":""},{"$f":"IF(COC!A44=0,\"\",COC!E44)","v":""},{"$f":"IF(COC!A44=0,\"\",COC!D44)","v":""},null,null,null,false]
[]
[null,"Convenciones","Vi: Volumen inicial de la muestra",null,null,"VRB: Volumen gastado de titulante para blanco de laboratorio"]
[null,null,"Vf: Volumen final de la muestra",null,null,"VLOQ: Volumen gastado de titulante para el limite de cuantificación "]
[null,null,"Vs.iTW: Volumen gastado de titulante ensayo 1",null,null,"VQC: Volumen gastado de titulante para el control de calidad"]
[null,null,"Vs.iiTW: Volumen gastado de titulante ensayo 2",null,null,"Va: Volumen de alicuota a titular"]
[]
[null,"Observaciones/ Novedades"]
[]
[]
[]
[]
[]
[null,null,null,null,"Informe de resultados"]
[null,"Realizó",null,null,null,"Revisó 1"]
[null,"Fecha",null,null,null,"Fecha"]
[null,"Observaciones"]
[]
[]
[]
[]
[]
[]
[]
[null,"Realizó",null,null,null,"Revisó 2"]
[null,"Fecha",null,null,null,"Fecha"]
[null,"Observaciones"]
[]
[]
[]
[]
[]
[]
[null,null,"Incidencia"]

{"sheet":"Cromatografía gases","index":5,"n_rows":74,"n_cols":11,"rows_kept":74,"cut":false,"hidden":true,"merged":[[0,0,2,9],[3,1,3,8],[4,2,4,3],[4,4,4,5],[5,2,5,3],[5,4,5,5],[54,6,54,8],[6,2,6,8],[7,1,7,8],[10,1,18,1],[10,3,12,3],[10,5,18,5],[10,7,12,7],[13,3,15,3],[13,7,15,7],[16,3,18,3],[16,7,18,7],[8,1,9,1],[8,2,8,3],[8,4,8,7],[9,2,9,3],[65,2,65,4],[65,6,65,8],[66,1,72,1],[66,2,72,8],[19,3,19,4],[55,2,55,4],[55,6,55,8],[56,1,62,1],[56,2,62,8],[64,2,64,4],[64,6,64,8],[19,1,19,2],[22,6,41,6],[47,1,51,1],[53,4,53,6],[54,2,54,4]]}
["Formato de analisis IH"]
[]
[]
[null,"Recepción de muestra"]
[null,"Movimiento",{"$f":"IF(COC!B4=0,\"\",COC!B4)","v":""},null,"Custodia",null,{"$f":"IF(COC!B4=0,\"\",COC!D4)","v":""},"Informe",{"$f":"IF(COC!B4=0,\"\",COC!F4)","v":""}]
[null,"Cantidad",{"$f":"IF(COC!B4=0,\"\",COC!B17)","v":""},null,"Fecha de recepción",null,{"$f":"IF(COC!B4=0,\"\",COC!B53)","v":""},"Hora ",{"$f":"IF(COC!$D$4=0,\"\",COC!E53)","v":""}]
[null,"Observaciones",{"$f":"IF(AND(COC!B55=0,COC!B20=0),\"Sin observaciones\",_xlfn.CONCAT(COC!B20,\"-\",COC!B55))","v":"Sin observaciones"}]
[null,"Análisis de muestras",null,null,"Analisis de las muestras"]
[null,"Equipo","CI "]
[null,null,"Almacenamiento",null,null,null,"Refrigeración"]
[null,"Fecha desorción",null,"Código LCSB",null,"Realizó",null,"Revisión Carta Control",false]
[null,null,null,null,null,null,null,null,false]
[null,null,null,null,null,null,null,null,false]
[null,null,null,"Código LCSM",null,null,null,"Revisión Carta Control",false]
[null,null,null,null,null,null,null,null,false]
[null,null,null,null,null,null,null,null,false]
[null,null,null,"Código ICV",null,null,null,"Revisión Carta Control",false]
[null,null,null,null,null,null,null,null,false]
[null,null,null,null,null,null,null,null,false]
[null,"Códigos verificados (10%)",null,null,null,"Fecha curva utilizada"]
[]
[null,"#","ID Laboratorio","Análisis","Método","Medio ","Fecha Desorción","V Desorción  (mL)","Cromatógrafo"]
[null,1,{"$f":"IF(COC!A25=0,\"\",COC!A25)","v":""},{"$f":"IF(COC!B25=0,\"\",COC!E25)","v":""},{"$f":"IF(COC!B25=0,\"\",COC!D25)","v":""},{"$f":"IF(COC!B25=0,\"\",COC!F25)","v":""},null,null,null,null,1]
[null,2,{"$f":"IF(COC!A26=0,\"\",COC!A26)","v":""},{"$f":"IF(COC!B26=0,\"\",COC!E26)","v":""},{"$f":"IF(COC!B26=0,\"\",COC!D26)","v":""},{"$f":"IF(COC!B26=0,\"\",COC!F26)","v":""},null,null,null,null,2]
[null,3,{"$f":"IF(COC!A27=0,\"\",COC!A27)","v":""},{"$f":"IF(COC!B27=0,\"\",COC!E27)","v":""},{"$f":"IF(COC!B27=0,\"\",COC!D27)","v":""},{"$f":"IF(COC!B27=0,\"\",COC!F27)","v":""},null,null,null,null,3]
[null,4,{"$f":"IF(COC!A28=0,\"\",COC!A28)","v":""},{"$f":"IF(COC!B28=0,\"\",COC!E28)","v":""},{"$f":"IF(COC!B28=0,\"\",COC!D28)","v":""},{"$f":"IF(COC!B28=0,\"\",COC!F28)","v":""},null,null,null,null,4]
[null,5,{"$f":"IF(COC!A29=0,\"\",COC!A29)","v":""},{"$f":"IF(COC!B29=0,\"\",COC!E29)","v":""},{"$f":"IF(COC!B29=0,\"\",COC!D29)","v":""},{"$f":"IF(COC!B29=0,\"\",COC!F29)","v":""},null,null,null,null,5]
[null,6,{"$f":"IF(COC!A30=0,\"\",COC!A30)","v":""},{"$f":"IF(COC!B30=0,\"\",COC!E30)","v":""},{"$f":"IF(COC!B30=0,\"\",COC!D30)","v":""},{"$f":"IF(COC!B30=0,\"\",COC!F30)","v":""},null,null,null,null,6]
[null,7,{"$f":"IF(COC!A31=0,\"\",COC!A31)","v":""},{"$f":"IF(COC!B31=0,\"\",COC!E31)","v":""},{"$f":"IF(COC!B31=0,\"\",COC!D31)","v":""},{"$f":"IF(COC!B31=0,\"\",COC!F31)","v":""},null,null,null,null,7]
[null,8,{"$f":"IF(COC!A32=0,\"\",COC!A32)","v":""},{"$f":"IF(COC!B32=0,\"\",COC!E32)","v":""},{"$f":"IF(COC!B32=0,\"\",COC!D32)","v":""},{"$f":"IF(COC!B32=0,\"\",COC!F32)","v":""},null,null,null,null,8]
[null,9,{"$f":"IF(COC!A33=0,\"\",COC!A33)","v":""},{"$f":"IF(COC!B33=0,\"\",COC!E33)","v":""},{"$f":"IF(COC!B33=0,\"\",COC!D33)","v":""},{"$f":"IF(COC!B33=0,\"\",COC!F33)","v":""},null,null,null,null,9]
[null,10,{"$f":"IF(COC!A34=0,\"\",COC!A34)","v":""},{"$f":"IF(COC!B34=0,\"\",COC!E34)","v":""},{"$f":"IF(COC!B34=0,\"\",COC!D34)","v":""},{"$f":"IF(COC!B34=0,\"\",COC!F34)","v":""},null,null,null,null,10]
[null,11,{"$f":"IF(COC!A35=0,\"\",COC!A35)","v":""},{"$f":"IF(COC!B35=0,\"\",COC!E35)","v":""},{"$f":"IF(COC!B35=0,\"\",COC!D35)","v":""},{"$f":"IF(COC!B35=0,\"\",COC!F35)","v":""},null,null,null,null,11]
[null,12,{"$f":"IF(COC!A36=0,\"\",COC!A36)","v":""},{"$f":"IF(COC!B36=0,\"\",COC!E36)","v":""},{"$f":"IF(COC!B36=0,\"\",COC!D36)","v":""},{"$f":"IF(COC!B36=0,\"\",COC!F36)","v":""},null,null,null,null,12]
[null,13,{"$f":"IF(COC!A37=0,\"\",COC!A37)","v":""},{"$f":"IF(COC!B37=0,\"\",COC!E37)","v":""},{"$f":"IF(COC!B37=0,\"\",COC!D37)","v":""},{"$f":"IF(COC!B37=0,\"\",COC!F37)","v":""},null,null,null,null,13]
[null,14,{"$f":"IF(COC!A38=0,\"\",COC!A38)","v":""},{"$f":"IF(COC!B38=0,\"\",COC!E38)","v":""},{"$f":"IF(COC!B38=0,\"\",COC!D38)","v":""},{"$f":"IF(COC!B38=0,\"\",COC!F38)","v":""},null,null,null,null,14]
[null,15,{"$f":"IF(COC!A39=0,\"\",COC!A39)","v":""},{"$f":"IF(COC!B39=0,\"\",COC!E39)","v":""},{"$f":"IF(COC!B39=0,\"\",COC!D39)","v":""},{"$f":"IF(COC!B39=0,\"\",COC!F39)","v":""},null,null,null,null,15]
[null,16,{"$f":"IF(COC!A40=0,\"\",COC!A40)","v":""},{"$f":"IF(COC!B40=0,\"\",COC!E40)","v":""},{"$f":"IF(COC!B40=0,\"\",COC!D40)","v":""},{"$f":"IF(COC!B40=0,\"\",COC!F40)","v":""},null,null,null,null,16]
[null,17,{"$f":"IF(COC!A41=0,\"\",COC!A41)","v":""},{"$f":"IF(COC!B41=0,\"\",COC!E41)","v":""},{"$f":"IF(COC!B41=0,\"\",COC!D41)","v":""},{"$f":"IF(COC!B41=0,\"\",COC!F41)","v":""},null,null,null,null,17]
[null,18,{"$f":"IF(COC!A42=0,\"\",COC!A42)","v":""},{"$f":"IF(COC!B42=0,\"\",COC!E42)","v":""},{"$f":"IF(COC!B42=0,\"\",COC!D42)","v":""},{"$f":"IF(COC!B42=0,\"\",COC!F42)","v":""},null,null,null,null,18]
[null,19,{"$f":"IF(COC!A43=0,\"\",COC!A43)","v":""},{"$f":"IF(COC!B43=0,\"\",COC!E43)","v":""},{"$f":"IF(COC!B43=0,\"\",COC!D43)","v":""},{"$f":"IF(COC!B43=0,\"\",COC!F43)","v":""},null,null,null,null,19]
[null,20,{"$f":"IF(COC!A44=0,\"\",COC!A44)","v":""},{"$f":"IF(COC!B44=0,\"\",COC!E44)","v":""},{"$f":"IF(COC!B44=0,\"\",COC!D44)","v":""},{"$f":"IF(COC!B44=0,\"\",COC!F44)","v":""},null,null,null,null,20]
[]
[]
[]
[]
[]
[null,"Observaciones/ Novedades"]
[]
[]
[]
[]
[]
[null,null,null,null,"Informe de resultados"]
[null,"Realizó",null,null,null,"Revisó 1"]
[null,"Fecha",null,null,null,"Fecha"]
[null,"Observaciones"]
[]
[]
[]
[]
[]
[]
[]
[null,"Realizó",null,null,null,"Revisó 2"]
[null,"Fecha",null,null,null,"Fecha"]
[null,"Observaciones"]
[]
[]
[]
[]
[]
[]
[null,null,"Incidencia"]

{"sheet":"Descripcion","index":6,"n_rows":978,"n_cols":11,"rows_kept":978,"cut":false,"hidden":true,"merged":[[0,0,2,10]]}
["Formato de analisis IH"]
[]
[]
[]
[null,"Métodos",null,"Método","Análisis",null,null,null,null,"Parametro","Medios"]
[null,"NIOSH 0500 / Gravimetría",null,"NIOSH 0500 / Gravimetría","Material particulado total",null,null,null,null,"Material particulado total","F. PVC 37 mm PW, 5 µm"]
[null,"NIOSH 0501 / Gravimetría",null,"NIOSH 0500 / Gravimetría","Fracción inhalable",null,null,null,null,"Material particulado total","F. Cap. PVC 37 mm PW, 5 µm"]
[null,"NIOSH 0600 / Gravimetría",null,"NIOSH 0501 / Gravimetría","Material particulado total",null,null,null,null,"Material particulado total","F. PVC 25 mm PW, 5 µm"]
[null,"NIOSH 1501 Mod / GC-FID",null,"NIOSH 0600 / Gravimetría","Fracción respirable",null,null,null,null,"Material particulado total","F. MCE 37 mm PW, 0.8 µm"]
[null,"NIOSH 1550 / GC-FID",null,"NIOSH 1501 Mod / GC-FID","Perfil BTEX",null,null,null,null,"Material particulado total","F. Cap. MCE 37 mm PW, 0.8 µm"]
[null,"NIOSH 1604 / GC-FID",null,"NIOSH 1501 Mod / GC-FID","Perfil alcoholes",null,null,null,null,"Material particulado total","Otro"]
[null,"NIOSH 2000 / GC-FID",null,"NIOSH 1501 Mod / GC-FID","Perfil de solventes",null,null,null,null,"Fracción inhalable","F. PVC 25 mm PW, 5 µm - IOM"]
[null,"NIOSH 2011 / IC",null,"NIOSH 1501 Mod / GC-FID","Perfil acetatos",null,null,null,null,"Fracción inhalable","F. PVC 25 mm PW, 5 µm - Button"]
[null,"NIOSH 2531 / GC-FID",null,"NIOSH 1501 Mod / GC-FID","Benceno (71-43-2)",null,null,null,null,"Fracción respirable","F. PVC 37 mm PW, 5 µm"]
[null,"NIOSH 2541 / GC-FID",null,"NIOSH 1501 Mod / GC-FID","Tolueno (108-88-3)",null,null,null,null,"Perfil BTEX","T. SKC 226-01"]
[null,"NIOSH 5000 / Gravimetría",null,"NIOSH 1501 Mod / GC-FID","Etilbenceno (100-41-4)",null,null,null,null,"Perfil BTEX","T. SKC 226-09"]
[null,"NIOSH 5040 / TOA",null,"NIOSH 1501 Mod / GC-FID","p-Xileno (108-38-3)",null,null,null,null,"Perfil BTEX","T. ZST-001"]
[null,"NIOSH 5506 / HPLC-FL/UV",null,"NIOSH 1501 Mod / GC-FID","m-Xileno (106-42-3)",null,null,null,null,"Perfil BTEX","T. ZST-002"]
[null,"NIOSH 5515 / GC-FID",null,"NIOSH 1501 Mod / GC-FID","o-Xileno (95-47-6)",null,null,null,null,"Perfil BTEX","T. ORBO 32S"]
[null,"NIOSH 6004 / IC",null,"NIOSH 1501 Mod / GC-FID","Xilenos - Xilol (1330-20-7)",null,null,null,null,"Perfil BTEX","T. ORBO 32L"]
[null,"NIOSH 6009 / CVAS",null,"NIOSH 1501 Mod / GC-FID","n-pentano (109-66-0)",null,null,null,null,"Perfil BTEX","PM SKC 575-001"]
[null,"NIOSH 6009 Mod / ICP-OES",null,"NIOSH 1501 Mod / GC-FID","Acetona (67-64-1)",null,null,null,null,"Perfil BTEX","PM SKC 575-002"]
[null,"NIOSH 6011 / IC",null,"NIOSH 1501 Mod / GC-FID","n-hexano (110-54-3)",null,null,null,null,"Perfil BTEX","PM 525AT"]
[null,"NIOSH 6013 / IC",null,"NIOSH 1501 Mod / GC-FID","2-Butanona (MEK) (78-93-3)",null,null,null,null,"Perfil BTEX","PM 546AT"]
[null,"NIOSH 6016 / IC",null,"NIOSH 1501 Mod / GC-FID","Etil acetato (141-78-6)",null,null,null,null,"Perfil BTEX","PM 566AT"]
[null,"NIOSH 7303 / ICP-OES",null,"NIOSH 1501 Mod / GC-FID","Tetrahidrofurano (109-99-9)",null,null,null,null,"Perfil BTEX","Otro"]
[null,"NIOSH 7400 / PCM",null,"NIOSH 1501 Mod / GC-FID","1,1,1-tricloroetano (71-55-6)",null,null,null,null,"Perfil alcoholes","T. SKC 226-01"]
[null,"NIOSH 7401 / Titulacion",null,"NIOSH 1501 Mod / GC-FID","1,2-dicloroetano (107-06-2)",null,null,null,null,"Perfil alcoholes","T. SKC 226-09"]
[null,"NIOSH 7402 / TEM",null,"NIOSH 1501 Mod / GC-FID","Isooctano (540-84-1)",null,null,null,null,"Perfil alcoholes","T. ZST-001"]
[null,"NIOSH 7500 / XRD",null,"NIOSH 1501 Mod / GC-FID","Heptano (142-82-5)",null,null,null,null,"Perfil alcoholes","T. ZST-002"]
[null,"NIOSH 7600 / UV-VIS",null,"NIOSH 1501 Mod / GC-FID","Tricloroetileno (79-01-6)",null,null,null,null,"Perfil alcoholes","T. ORBO 32S"]
[null,"NIOSH 7906 / IC",null,"NIOSH 1501 Mod / GC-FID","Propil acetato (109-60-4)",null,null,null,null,"Perfil alcoholes","T. ORBO 32L"]
[null,"NIOSH 7907 / IC",null,"NIOSH 1501 Mod / GC-FID","1,4-Dioxano (123-91-1)",null,null,null,null,"Perfil alcoholes","Otro"]
[null,"NIOSH 7908 / IC",null,"NIOSH 1501 Mod / GC-FID","4-metil-2-pentanona (108-10-1)",null,null,null,null,"Perfil alcoholes","Bulk Sample"]
[null,"OSHA 1019 / UV-VIS",null,"NIOSH 1501 Mod / GC-FID","Octano (111-65-9)",null,null,null,null,"Perfil acetatos","T. SKC 226-01"]
[null,"OSHA ID-174SG / IC",null,"NIOSH 1501 Mod / GC-FID","Tetracloroetileno (127-18-4)",null,null,null,null,"Perfil acetatos","T. SKC 226-09"]
[null,"OSHA ID-165SG / IC",null,"NIOSH 1501 Mod / GC-FID","Butilacetato (123-86-4)",null,null,null,null,"Perfil acetatos","T. ZST-001"]
[null,"OSHA ID-113/115 / IC",null,"NIOSH 1501 Mod / GC-FID","Clorobeneno (108-90-7)",null,null,null,null,"Perfil acetatos","T. ZST-002"]
[null,"OSHA ID-202 / IC",null,"NIOSH 1501 Mod / GC-FID","Estireno (100-42-5)",null,null,null,null,"Perfil acetatos","T. ORBO 32S"]
[null,"OSHA ID-214 / IC",null,"NIOSH 1501 Mod / GC-FID","Decano (124-18-5)",null,null,null,null,"Perfil acetatos","T. ORBO 32L"]
[null,"EPA 600/R-93-116 / PLM",null,"NIOSH 1501 Mod / GC-FID","1,2,4-trimetilbenceno (95-63-6)",null,null,null,null,"Perfil acetatos","Otro"]
[null,"OTRO",null,"NIOSH 1501 Mod / GC-FID","Naftaleno (91-20-3)",null,null,null,null,"Perfil acetatos","Bulk Sample"]
[null,null,null,"NIOSH 1501 Mod / GC-FID","Ciclohexanona (108-94-1)",null,null,null,null,"Benceno (71-43-2)","T. SKC 226-01"]
[null,null,null,"NIOSH 1501 Mod / GC-FID","Cloroformo (67-66-3)",null,null,null,null,"Benceno (71-43-2)","T. SKC 226-09"]
[null,null,null,"NIOSH 1501 Mod / GC-FID","Etanol (64-17-5)",null,null,null,null,"Benceno (71-43-2)","T. ZST-001"]
[null,null,null,"NIOSH 1501 Mod / GC-FID","Isopropanol (67-63-0)",null,null,null,null,"Benceno (71-43-2)","T. ZST-002"]
[null,null,null,"NIOSH 1501 Mod / GC-FID","n-propanol (71-23-8)",null,null,null,null,"Benceno (71-43-2)","T. ORBO 32S"]
[null,null,null,"NIOSH 1501 Mod / GC-FID","2-butanol (4221-99-2)",null,null,null,null,"Benceno (71-43-2)","T. ORBO 32L"]
[null,null,null,"NIOSH 1501 Mod / GC-FID","1-butanol (71-36-3)",null,null,null,null,"Benceno (71-43-2)","PM SKC 575-001"]
[null,null,null,"NIOSH 1550 / GC-FID","Éter de petróleo (8032-32-4)",null,null,null,null,"Benceno (71-43-2)","PM SKC 575-002"]
[null,null,null,"NIOSH 1550 / GC-FID","Rubber solvent (8030-30-6)",null,null,null,null,"Benceno (71-43-2)","PM 525AT"]
[null,null,null,"NIOSH 1550 / GC-FID","Nafta de petróleo (8002-05-9)",null,null,null,null,"Benceno (71-43-2)","PM 546AT"]
[null,null,null,"NIOSH 1550 / GC-FID","VM&P naphtha (8032-32-4)",null,null,null,null,"Benceno (71-43-2)","PM 566AT"]
[null,null,null,"NIOSH 1550 / GC-FID","Mineral spirits (8052-41-3)",null,null,null,null,"Benceno (71-43-2)","Otro"]
[null,null,null,"NIOSH 1550 / GC-FID","Stoddard solvent (8052-41-3)",null,null,null,null,"Benceno (71-43-2)","Bulk Sample"]
[null,null,null,"NIOSH 1550 / GC-FID","Kerosene (8008-20-6)",null,null,null,null,"Tolueno (108-88-3)","T. SKC 226-01"]
[null,null,null,"NIOSH 1550 / GC-FID","Coal tar naphtha (8030-30-6)",null,null,null,null,"Tolueno (108-88-3)","T. SKC 226-09"]
[null,null,null,"NIOSH 1550 / GC-FID","Gasolina (8006-61-9)",null,null,null,null,"Tolueno (108-88-3)","T. ZST-001"]
[null,null,null,"NIOSH 1604 / GC-FID","Acrilonitrilo (107-13-1)",null,null,null,null,"Tolueno (108-88-3)","T. ZST-002"]
[null,null,null,"NIOSH 2000 / GC-FID","Metanol (67-56-1)",null,null,null,null,"Tolueno (108-88-3)","T. ORBO 32S"]
[null,null,null,"NIOSH 2011 / IC","Ácido fórmico (64-18-6)",null,null,null,null,"Tolueno (108-88-3)","T. ORBO 32L"]
[null,null,null,"NIOSH 2531 / GC-FID","Glutaraldehido  (111-30-8)",null,null,null,null,"Tolueno (108-88-3)","PM SKC 575-001"]
[null,null,null,"NIOSH 2541 / GC-FID","Formaldehido (50-00-0)",null,null,null,null,"Tolueno (108-88-3)","PM SKC 575-002"]
[null,null,null,"NIOSH 5000 / Gravimetría","Carbon black (1333-86-4)",null,null,null,null,"Tolueno (108-88-3)","PM 525AT"]
[null,null,null,"NIOSH 5040 / TOA","DPM  (7440-44-0)",null,null,null,null,"Tolueno (108-88-3)","PM 546AT"]
[null,null,null,"NIOSH 5506 / HPLC-FL/UV","PAH's",null,null,null,null,"Tolueno (108-88-3)","PM 566AT"]
[null,null,null,"NIOSH 5506 / HPLC-FL/UV","Acenafteno ( 83-32-9)",null,null,null,null,"Tolueno (108-88-3)","Otro"]
[null,null,null,"NIOSH 5506 / HPLC-FL/UV","Acenaftileno (208-96-8)",null,null,null,null,"Tolueno (108-88-3)","Bulk Sample"]
[null,null,null,"NIOSH 5506 / HPLC-FL/UV","Antraceno (120-12-7)",null,null,null,null,"Etilbenceno (100-41-4)","T. SKC 226-01"]
[null,null,null,"NIOSH 5506 / HPLC-FL/UV","Benz[a]antraceno (56-55-3)",null,null,null,null,"Etilbenceno (100-41-4)","T. SKC 226-09"]
[null,null,null,"NIOSH 5506 / HPLC-FL/UV","Benzo[e]acefenantrileno (205-99-2)",null,null,null,null,"Etilbenceno (100-41-4)","T. ZST-001"]
[null,null,null,"NIOSH 5506 / HPLC-FL/UV","Benzo[k]fluoranteno (207-08-9)",null,null,null,null,"Etilbenceno (100-41-4)","T. ZST-002"]
[null,null,null,"NIOSH 5506 / HPLC-FL/UV","Benzo(g,h,i)perileno (191-24-2)",null,null,null,null,"Etilbenceno (100-41-4)","T. ORBO 32S"]
[null,null,null,"NIOSH 5506 / HPLC-FL/UV","Benzopireno (50-32-8)",null,null,null,null,"Etilbenceno (100-41-4)","T. ORBO 32L"]
[null,null,null,"NIOSH 5506 / HPLC-FL/UV","Benzo[e]pyrene ( 192-97-2)",null,null,null,null,"Etilbenceno (100-41-4)","PM SKC 575-001"]
[null,null,null,"NIOSH 5506 / HPLC-FL/UV","Criseno (218-01-9)",null,null,null,null,"Etilbenceno (100-41-4)","PM SKC 575-002"]
[null,null,null,"NIOSH 5506 / HPLC-FL/UV","Dibenzo[a,h]antraceno ( 53-70-3)",null,null,null,null,"Etilbenceno (100-41-4)","PM 525AT"]
[null,null,null,"NIOSH 5506 / HPLC-FL/UV","Fluoranteno (206-44-0)",null,null,null,null,"Etilbenceno (100-41-4)","PM 546AT"]
[null,null,null,"NIOSH 5506 / HPLC-FL/UV","Fluoreno (86-73-7)",null,null,null,null,"Etilbenceno (100-41-4)","PM 566AT"]
[null,null,null,"NIOSH 5506 / HPLC-FL/UV","Indeno(1,2,3-cd)pireno (193-39-5)",null,null,null,null,"Etilbenceno (100-41-4)","Otro"]
[null,null,null,"NIOSH 5506 / HPLC-FL/UV","Naftaleno (91-20-3)",null,null,null,null,"Etilbenceno (100-41-4)","Bulk Sample"]
[null,null,null,"NIOSH 5506 / HPLC-FL/UV","Fenantreno ( 85-01-8)",null,null,null,null,"p-Xileno (108-38-3)","T. SKC 226-01"]
[null,null,null,"NIOSH 5506 / HPLC-FL/UV","Pireno (129-00-0)",null,null,null,null,"p-Xileno (108-38-3)","T. SKC 226-09"]
[null,null,null,"NIOSH 5515 / GC-FID","PAH's",null,null,null,null,"p-Xileno (108-38-3)","T. ZST-001"]
[null,null,null,"NIOSH 5515 / GC-FID","Acenafteno ( 83-32-9)",null,null,null,null,"p-Xileno (108-38-3)","T. ZST-002"]
[null,null,null,"NIOSH 5515 / GC-FID","Acenaftileno (208-96-8)",null,null,null,null,"p-Xileno (108-38-3)","T. ORBO 32S"]
[null,null,null,"NIOSH 5515 / GC-FID","Antraceno (120-12-7)",null,null,null,null,"p-Xileno (108-38-3)","T. ORBO 32L"]
[null,null,null,"NIOSH 5515 / GC-FID","Benz[a]antraceno (56-55-3)",null,null,null,null,"p-Xileno (108-38-3)","PM SKC 575-001"]
[null,null,null,"NIOSH 5515 / GC-FID","Benzo[e]acefenantrileno (205-99-2)",null,null,null,null,"p-Xileno (108-38-3)","PM SKC 575-002"]
[null,null,null,"NIOSH 5515 / GC-FID","Benzo[k]fluoranteno (207-08-9)",null,null,null,null,"p-Xileno (108-38-3)","PM 525AT"]
[null,null,null,"NIOSH 5515 / GC-FID","Benzo(g,h,i)perileno (191-24-2)",null,null,null,null,"p-Xileno (108-38-3)","PM 546AT"]
[null,null,null,"NIOSH 5515 / GC-FID","Benzopireno (50-32-8)",null,null,null,null,"p-Xileno (108-38-3)","PM 566AT"]
[null,null,null,"NIOSH 5515 / GC-FID","Benzo[e]pyrene ( 192-97-2)",null,null,null,null,"p-Xileno (108-38-3)","Otro"]
[null,null,null,"NIOSH 5515 / GC-FID","Criseno (218-01-9)",null,null,null,null,"p-Xileno (108-38-3)","Bulk Sample"]
[null,null,null,"NIOSH 5515 / GC-FID","Dibenzo[a,h]antraceno ( 53-70-3)",null,null,null,null,"m-Xileno (106-42-3)","T. SKC 226-01"]
[null,null,null,"NIOSH 5515 / GC-FID","Fluoranteno (206-44-0)",null,null,null,null,"m-Xileno (106-42-3)","T. SKC 226-09"]
[null,null,null,"NIOSH 5515 / GC-FID","Fluoreno (86-73-7)",null,null,null,null,"m-Xileno (106-42-3)","T. ZST-001"]
[null,null,null,"NIOSH 5515 / GC-FID","Indeno(1,2,3-cd)pireno (193-39-5)",null,null,null,null,"m-Xileno (106-42-3)","T. ZST-002"]
[null,null,null,"NIOSH 5515 / GC-FID","Naftaleno (91-20-3)",null,null,null,null,"m-Xileno (106-42-3)","T. ORBO 32S"]
[null,null,null,"NIOSH 5515 / GC-FID","Fenantreno ( 85-01-8)",null,null,null,null,"m-Xileno (106-42-3)","T. ORBO 32L"]
[null,null,null,"NIOSH 5515 / GC-FID","Pireno (129-00-0)",null,null,null,null,"m-Xileno (106-42-3)","PM SKC 575-001"]
[null,null,null,"NIOSH 6004 / IC","Dióxido de azufre (7446-09-5)",null,null,null,null,"m-Xileno (106-42-3)","PM SKC 575-002"]
[null,null,null,"NIOSH 6009 / CVAS","Mercurio (7439-97-6)",null,null,null,null,"m-Xileno (106-42-3)","PM 525AT"]
[null,null,null,"NIOSH 6009 Mod / ICP-OES","Mercurio (7439-97-6)",null,null,null,null,"m-Xileno (106-42-3)","PM 546AT"]
[null,null,null,"NIOSH 6011 / IC","Bromo (7726-95-6)",null,null,null,null,"m-Xileno (106-42-3)","PM 566AT"]
[null,null,null,"NIOSH 6011 / IC","Cloro (7782-50-5)",null,null,null,null,"m-Xileno (106-42-3)","Otro"]
[null,null,null,"NIOSH 6013 / IC","Sulfuro de hidrógeno (7783-06-4)",null,null,null,null,"m-Xileno (106-42-3)","Bulk Sample"]
[null,null,null,"NIOSH 6016 / IC","Amoniaco (7664-41-7)",null,null,null,null,"o-Xileno (95-47-6)","T. SKC 226-01"]
[null,null,null,"NIOSH 7303 / ICP-OES","Perfil metalico (21)",null,null,null,null,"o-Xileno (95-47-6)","T. SKC 226-09"]
[null,null,null,"NIOSH 7303 / ICP-OES","Humos de soldadura (15)",null,null,null,null,"o-Xileno (95-47-6)","T. ZST-001"]
[null,null,null,"NIOSH 7303 / ICP-OES","Aluminio (Al)",null,null,null,null,"o-Xileno (95-47-6)","T. ZST-002"]
[null,null,null,"NIOSH 7303 / ICP-OES","Plata (Ag)",null,null,null,null,"o-Xileno (95-47-6)","T. ORBO 32S"]
[null,null,null,"NIOSH 7303 / ICP-OES","Arsénico (As)",null,null,null,null,"o-Xileno (95-47-6)","T. ORBO 32L"]
[null,null,null,"NIOSH 7303 / ICP-OES","Bario (Ba)",null,null,null,null,"o-Xileno (95-47-6)","PM SKC 575-001"]
[null,null,null,"NIOSH 7303 / ICP-OES","Berilio (Be)",null,null,null,null,"o-Xileno (95-47-6)","PM SKC 575-002"]
[null,null,null,"NIOSH 7303 / ICP-OES","Boro (B)",null,null,null,null,"o-Xileno (95-47-6)","PM 525AT"]
[null,null,null,"NIOSH 7303 / ICP-OES","Calcio (Ca)",null,null,null,null,"o-Xileno (95-47-6)","PM 546AT"]
[null,null,null,"NIOSH 7303 / ICP-OES","Cobre (Cu)",null,null,null,null,"o-Xileno (95-47-6)","PM 566AT"]
[null,null,null,"NIOSH 7303 / ICP-OES","Cadmio (Cd)",null,null,null,null,"o-Xileno (95-47-6)","Otro"]
[null,null,null,"NIOSH 7303 / ICP-OES","Cobalto (Co)",null,null,null,null,"o-Xileno (95-47-6)","Bulk Sample"]
[null,null,null,"NIOSH 7303 / ICP-OES","Cromo (Cr)",null,null,null,null,"Xilenos - Xilol (1330-20-7)","T. SKC 226-01"]
[null,null,null,"NIOSH 7303 / ICP-OES","Hierro (Fe)",null,null,null,null,"Xilenos - Xilol (1330-20-7)","T. SKC 226-09"]
[null,null,null,"NIOSH 7303 / ICP-OES","Fosforo (P)",null,null,null,null,"Xilenos - Xilol (1330-20-7)","T. ZST-001"]
[null,null,null,"NIOSH 7303 / ICP-OES","Potasio (K)",null,null,null,null,"Xilenos - Xilol (1330-20-7)","T. ZST-002"]
[null,null,null,"NIOSH 7303 / ICP-OES","Litio (Li)",null,null,null,null,"Xilenos - Xilol (1330-20-7)","T. ORBO 32S"]
[null,null,null,"NIOSH 7303 / ICP-OES","Magnesio (Mg)",null,null,null,null,"Xilenos - Xilol (1330-20-7)","T. ORBO 32L"]
[null,null,null,"NIOSH 7303 / ICP-OES","Manganeso (Mn)",null,null,null,null,"Xilenos - Xilol (1330-20-7)","PM SKC 575-001"]
[null,null,null,"NIOSH 7303 / ICP-OES","Molibdeno (Mo)",null,null,null,null,"Xilenos - Xilol (1330-20-7)","PM SKC 575-002"]
[null,null,null,"NIOSH 7303 / ICP-OES","Níquel (Ni)",null,null,null,null,"Xilenos - Xilol (1330-20-7)","PM 525AT"]
[null,null,null,"NIOSH 7303 / ICP-OES","Plomo (Pb)",null,null,null,null,"Xilenos - Xilol (1330-20-7)","PM 546AT"]
[null,null,null,"NIOSH 7303 / ICP-OES","Selenio (Se)",null,null,null,null,"Xilenos - Xilol (1330-20-7)","PM 566AT"]
[null,null,null,"NIOSH 7303 / ICP-OES","Antimonio (Sb)",null,null,null,null,"Xilenos - Xilol (1330-20-7)","Otro"]
[null,null,null,"NIOSH 7303 / ICP-OES","Estaño (Sn)",null,null,null,null,"Xilenos - Xilol (1330-20-7)","Bulk Sample"]
[null,null,null,"NIOSH 7303 / ICP-OES","Titanio (Ti)",null,null,null,null,"n-pentano (109-66-0)","T. SKC 226-01"]
[null,null,null,"NIOSH 7303 / ICP-OES","Talio (Tl)",null,null,null,null,"n-pentano (109-66-0)","T. SKC 226-09"]
[null,null,null,"NIOSH 7303 / ICP-OES","Vanadio (V)",null,null,null,null,"n-pentano (109-66-0)","T. ZST-001"]
[null,null,null,"NIOSH 7303 / ICP-OES","Zinc (Zn)",null,null,null,null,"n-pentano (109-66-0)","T. ZST-002"]
[null,null,null,"NIOSH 7400 / PCM","Fibras de asbesto - Reglas A",null,null,null,null,"n-pentano (109-66-0)","T. ORBO 32S"]
[null,null,null,"NIOSH 7400 / PCM","Fibras de vidrio - Reglas B",null,null,null,null,"n-pentano (109-66-0)","T. ORBO 32L"]
[null,null,null,"NIOSH 7400 / PCM","Fibras cerámicas - Reglas B",null,null,null,null,"n-pentano (109-66-0)","PM SKC 575-001"]
[null,null,null,"NIOSH 7400 / PCM","Fibras naturales - Reglas B",null,null,null,null,"n-pentano (109-66-0)","PM 525AT"]
[null,null,null,"NIOSH 7401 / Titulacion","Hidroxido de sodio  (1310-73-2)",null,null,null,null,"n-pentano (109-66-0)","PM 546AT"]
[null,null,null,"NIOSH 7401 / Titulacion","Hidroxido de potasio (1310-58-3)",null,null,null,null,"n-pentano (109-66-0)","PM 566AT"]
[null,null,null,"NIOSH 7401 / Titulacion","Hidroxido de litio (1310-65-2)",null,null,null,null,"n-pentano (109-66-0)","Otro"]
[null,null,null,"NIOSH 7402 / TEM","Fibras de asbesto",null,null,null,null,"n-pentano (109-66-0)","Bulk Sample"]
[null,null,null,"NIOSH 7500 / XRD","Silice cristalina",null,null,null,null,"Acetona (67-64-1)","T. SKC 226-01"]
[null,null,null,"NIOSH 7500 / XRD","Cuarzo  (14808-60-7)",null,null,null,null,"Acetona (67-64-1)","T. SKC 226-09"]
[null,null,null,"NIOSH 7500 / XRD","Cristobalita (14464-46-1)",null,null,null,null,"Acetona (67-64-1)","T. ZST-001"]
[null,null,null,"NIOSH 7600 / UV-VIS","Cromo VI soluble (18540-29-9 )",null,null,null,null,"Acetona (67-64-1)","T. ZST-002"]
[null,null,null,"NIOSH 7600 / UV-VIS","Cromo VI insoluble (18540-29-9 )",null,null,null,null,"Acetona (67-64-1)","T. ORBO 32S"]
[null,null,null,"NIOSH 7600 / UV-VIS","Ácido crómico (7738-94-5​)",null,null,null,null,"Acetona (67-64-1)","T. ORBO 32L"]
[null,null,null,"NIOSH 7906 / IC","Particulas de floruro",null,null,null,null,"Acetona (67-64-1)","PM SKC 575-002"]
[null,null,null,"NIOSH 7906 / IC","Ácido fluorhídrico (7664-39-3)",null,null,null,null,"Acetona (67-64-1)","PM 525AT"]
[null,null,null,"NIOSH 7907 / IC","Ácido clorhídrico (7647-01-0)",null,null,null,null,"Acetona (67-64-1)","PM 546AT"]
[null,null,null,"NIOSH 7907 / IC","Ácido bromhídrico (10035-10-6)",null,null,null,null,"Acetona (67-64-1)","PM 566AT"]
[null,null,null,"NIOSH 7907 / IC","Ácido nítrico (7697-37-2)",null,null,null,null,"Acetona (67-64-1)","Otro"]
[null,null,null,"NIOSH 7908 / IC","Ácido sulfúrico (7664-93-9)",null,null,null,null,"Acetona (67-64-1)","Bulk Sample"]
[null,null,null,"NIOSH 7908 / IC","Ácido fosfórico (7664-38-2)",null,null,null,null,"n-hexano (110-54-3)","SKC 226-01"]
[null,null,null,"OSHA 1019 / UV-VIS","Peróxido de hidrógeno (7722-84-1)",null,null,null,null,"n-hexano (110-54-3)","SKC 226-09"]
[null,null,null,"OSHA ID-174SG / IC","Ácido clorhídrico (7647-01-0)",null,null,null,null,"n-hexano (110-54-3)","T. ZST-001"]
[null,null,null,"OSHA ID-165SG / IC","Ácido  fluorhídrico (7664-39-3 )",null,null,null,null,"n-hexano (110-54-3)","T. ZST-002"]
[null,null,null,"OSHA ID-165SG / IC","Ácido clorhídrico (7647-01-0)",null,null,null,null,"n-hexano (110-54-3)","T. ORBO 32S"]
[null,null,null,"OSHA ID-165SG / IC","Ácido bromhídrico (10035-10-6)",null,null,null,null,"n-hexano (110-54-3)","T. ORBO 32L"]
[null,null,null,"OSHA ID-165SG / IC","Ácido nítrico (7697-37-2)",null,null,null,null,"n-hexano (110-54-3)","PM SKC 575-001"]
[null,null,null,"OSHA ID-165SG / IC","Ácido sulfúrico (7664-93-9",null,null,null,null,"n-hexano (110-54-3)","PM SKC 575-002"]
[null,null,null,"OSHA ID-165SG / IC","Ácido fosfórico (7664-38-2)",null,null,null,null,"n-hexano (110-54-3)","PM 525AT"]
[null,null,null,"OSHA ID-113/115 / IC","Ácido sulfúrico (7664-93-9)",null,null,null,null,"n-hexano (110-54-3)","PM 546AT"]
[null,null,null,"OSHA ID-113/115 / IC","Ácido fosfórico (7664-38-2)",null,null,null,null,"n-hexano (110-54-3)","PM 566AT"]
[null,null,null,"OSHA ID-202 / IC","Dióxido de cloro (10049-04-4)",null,null,null,null,"n-hexano (110-54-3)","Otro"]
[null,null,null,"OSHA ID-214 / IC","Ozono (10028-15-6)",null,null,null,null,"n-hexano (110-54-3)","Bulk Sample"]
[null,null,null,"EPA 600/R-93-116 / PLM","Asbesto",null,null,null,null,"2-Butanona (MEK) (78-93-3)","T. SKC 226-01"]
[null,null,null,"OTRO","OTRO",null,null,null,null,"2-Butanona (MEK) (78-93-3)","T. SKC 226-09"]
[null,null,null,"NIOSH 1501 Mod / GC-FID","Metil acetato (79-20-9)",null,null,null,null,"2-Butanona (MEK) (78-93-3)","T. ZST-001"]
[null,null,null,"NIOSH 1501 Mod / GC-FID","Vinil acetato (108-05-4)",null,null,null,null,"2-Butanona (MEK) (78-93-3)","T. ZST-002"]
[null,null,null,"NIOSH 1501 Mod / GC-FID","Isopropil acetato (108-21-4)",null,null,null,null,"2-Butanona (MEK) (78-93-3)","T. ORBO 32S"]
[null,null,null,"NIOSH 1501 Mod / GC-FID","n-amilo acetato (628-63-7)",null,null,null,null,"2-Butanona (MEK) (78-93-3)","T. ORBO 32L"]
[null,null,null,"NIOSH 1501 Mod / GC-FID","HCT's como n-hexano",null,null,null,null,"2-Butanona (MEK) (78-93-3)","PM SKC 575-002"]
[null,null,null,"NIOSH 2532 / HPLC-UV","Glutaraldehido  (111-30-8)",null,null,null,null,"2-Butanona (MEK) (78-93-3)","PM 525AT"]
[null,null,null,"NIOSH 2016 / HPLC-UV","Formaldehido (50-00-0)",null,null,null,null,"2-Butanona (MEK) (78-93-3)","PM 546AT"]
[null,null,null,"ASTM D5578 / GC-ECD","Oxido de etileno (75-21-8)",null,null,null,null,"2-Butanona (MEK) (78-93-3)","PM 566AT"]
[null,null,null,"OSHA 1010 / GC-ECD","Oxido de etileno (75-21-8)",null,null,null,null,"2-Butanona (MEK) (78-93-3)","Otro"]
[null,null,null,null,null,null,null,null,null,"2-Butanona (MEK) (78-93-3)","Bulk Sample"]
[null,null,null,null,null,null,null,null,null,"Etil acetato (141-78-6)","T. SKC 226-01"]
[null,null,null,null,null,null,null,null,null,"Etil acetato (141-78-6)","T. SKC 226-09"]
[null,null,null,null,null,null,null,null,null,"Etil acetato (141-78-6)","T. ZST-001"]
[null,null,null,null,null,null,null,null,null,"Etil acetato (141-78-6)","T. ZST-002"]
[null,null,null,null,null,null,null,null,null,"Etil acetato (141-78-6)","T. ORBO 32S"]
[null,null,null,null,null,null,null,null,null,"Etil acetato (141-78-6)","T. ORBO 32L"]
[null,null,null,null,null,null,null,null,null,"Etil acetato (141-78-6)","PM SKC 575-001"]
[null,null,null,null,null,null,null,null,null,"Etil acetato (141-78-6)","PM SKC 575-002"]
[null,null,null,null,null,null,null,null,null,"Etil acetato (141-78-6)","PM 525AT"]
[null,null,null,null,null,null,null,null,null,"Etil acetato (141-78-6)","PM 546AT"]
[null,null,null,null,null,null,null,null,null,"Etil acetato (141-78-6)","PM 566AT"]
[null,null,null,null,null,null,null,null,null,"Etil acetato (141-78-6)","Otro"]
[null,null,null,null,null,null,null,null,null,"Etil acetato (141-78-6)","Bulk Sample"]
[null,null,null,null,null,null,null,null,null,"Tetrahidrofurano (109-99-9)","T. SKC 226-01"]
[null,null,null,null,null,null,null,null,null,"Tetrahidrofurano (109-99-9)","T. SKC 226-09"]
[null,null,null,null,null,null,null,null,null,"Tetrahidrofurano (109-99-9)","T. ZST-001"]
[null,null,null,null,null,null,null,null,null,"Tetrahidrofurano (109-99-9)","T. ZST-002"]
[null,null,null,null,null,null,null,null,null,"Tetrahidrofurano (109-99-9)","T. ORBO 32S"]
[null,null,null,null,null,null,null,null,null,"Tetrahidrofurano (109-99-9)","T. ORBO 32L"]
[null,null,null,null,null,null,null,null,null,"Tetrahidrofurano (109-99-9)","PM SKC 575-001"]
[null,null,null,null,null,null,null,null,null,"Tetrahidrofurano (109-99-9)","PM 525AT"]
[null,null,null,null,null,null,null,null,null,"Tetrahidrofurano (109-99-9)","PM 546AT"]
[null,null,null,null,null,null,null,null,null,"Tetrahidrofurano (109-99-9)","PM 566AT"]
[null,null,null,null,null,null,null,null,null,"Tetrahidrofurano (109-99-9)","Otro"]
[null,null,null,null,null,null,null,null,null,"Tetrahidrofurano (109-99-9)","Bulk Sample"]
[null,null,null,null,null,null,null,null,null,"1,1,1-tricloroetano (71-55-6)","T. SKC 226-01"]
[null,null,null,null,null,null,null,null,null,"1,1,1-tricloroetano (71-55-6)","T. SKC 226-09"]
[null,null,null,null,null,null,null,null,null,"1,1,1-tricloroetano (71-55-6)","T. ZST-001"]
[null,null,null,null,null,null,null,null,null,"1,1,1-tricloroetano (71-55-6)","T. ZST-002"]
[null,null,null,null,null,null,null,null,null,"1,1,1-tricloroetano (71-55-6)","T. ORBO 32S"]
[null,null,null,null,null,null,null,null,null,"1,1,1-tricloroetano (71-55-6)","T. ORBO 32L"]
[null,null,null,null,null,null,null,null,null,"1,1,1-tricloroetano (71-55-6)","PM SKC 575-001"]
[null,null,null,null,null,null,null,null,null,"1,1,1-tricloroetano (71-55-6)","PM 525AT"]
[null,null,null,null,null,null,null,null,null,"1,1,1-tricloroetano (71-55-6)","Otro"]
[null,null,null,null,null,null,null,null,null,"1,1,1-tricloroetano (71-55-6)","Bulk Sample"]
[null,null,null,null,null,null,null,null,null,"1,2-dicloroetano (107-06-2)","T. SKC 226-01"]
[null,null,null,null,null,null,null,null,null,"1,2-dicloroetano (107-06-2)","T. SKC 226-09"]
[null,null,null,null,null,null,null,null,null,"1,2-dicloroetano (107-06-2)","T. ZST-001"]
[null,null,null,null,null,null,null,null,null,"1,2-dicloroetano (107-06-2)","T. ZST-002"]
[null,null,null,null,null,null,null,null,null,"1,2-dicloroetano (107-06-2)","T. ORBO 32S"]
[null,null,null,null,null,null,null,null,null,"1,2-dicloroetano (107-06-2)","T. ORBO 32L"]
[null,null,null,null,null,null,null,null,null,"1,2-dicloroetano (107-06-2)","PM SKC 575-001"]
[null,null,null,null,null,null,null,null,null,"1,2-dicloroetano (107-06-2)","PM 525AT"]
[null,null,null,null,null,null,null,null,null,"1,2-dicloroetano (107-06-2)","Otro"]
[null,null,null,null,null,null,null,null,null,"1,2-dicloroetano (107-06-2)","Bulk Sample"]
[null,null,null,null,null,null,null,null,null,"Isooctano (540-84-1)","T. SKC 226-01"]
[null,null,null,null,null,null,null,null,null,"Isooctano (540-84-1)","T. SKC 226-09"]
[null,null,null,null,null,null,null,null,null,"Isooctano (540-84-1)","T. ZST-001"]
[null,null,null,null,null,null,null,null,null,"Isooctano (540-84-1)","T. ZST-002"]
[null,null,null,null,null,null,null,null,null,"Isooctano (540-84-1)","T. ORBO 32S"]
[null,null,null,null,null,null,null,null,null,"Isooctano (540-84-1)","T. ORBO 32L"]
[null,null,null,null,null,null,null,null,null,"Isooctano (540-84-1)","PM SKC 575-001"]
[null,null,null,null,null,null,null,null,null,"Isooctano (540-84-1)","PM 525AT"]
[null,null,null,null,null,null,null,null,null,"Isooctano (540-84-1)","Otro"]
[null,null,null,null,null,null,null,null,null,"Isooctano (540-84-1)","Bulk Sample"]
[null,null,null,null,null,null,null,null,null,"Heptano (142-82-5)","T. SKC 226-01"]
[null,null,null,null,null,null,null,null,null,"Heptano (142-82-5)","T. SKC 226-09"]
[null,null,null,null,null,null,null,null,null,"Heptano (142-82-5)","T. ZST-001"]
[null,null,null,null,null,null,null,null,null,"Heptano (142-82-5)","T. ZST-002"]
[null,null,null,null,null,null,null,null,null,"Heptano (142-82-5)","T. ORBO 32S"]
[null,null,null,null,null,null,null,null,null,"Heptano (142-82-5)","T. ORBO 32L"]
[null,null,null,null,null,null,null,null,null,"Heptano (142-82-5)","PM SKC 575-001"]
[null,null,null,null,null,null,null,null,null,"Heptano (142-82-5)","PM SKC 575-002"]
[null,null,null,null,null,null,null,null,null,"Heptano (142-82-5)","PM 525AT"]
[null,null,null,null,null,null,null,null,null,"Heptano (142-82-5)","Otro"]
[null,null,null,null,null,null,null,null,null,"Heptano (142-82-5)","Bulk Sample"]
[null,null,null,null,null,null,null,null,null,"Tricloroetileno (79-01-6)","T. SKC 226-01"]
[null,null,null,null,null,null,null,null,null,"Tricloroetileno (79-01-6)","T. SKC 226-09"]
[null,null,null,null,null,null,null,null,null,"Tricloroetileno (79-01-6)","T. ZST-001"]
[null,null,null,null,null,null,null,null,null,"Tricloroetileno (79-01-6)","T. ZST-002"]
[null,null,null,null,null,null,null,null,null,"Tricloroetileno (79-01-6)","T. ORBO 32S"]
[null,null,null,null,null,null,null,null,null,"Tricloroetileno (79-01-6)","T. ORBO 32L"]
[null,null,null,null,null,null,null,null,null,"Tricloroetileno (79-01-6)","PM SKC 575-001"]
[null,null,null,null,null,null,null,null,null,"Tricloroetileno (79-01-6)","PM SKC 575-002"]
[null,null,null,null,null,null,null,null,null,"Tricloroetileno (79-01-6)","PM 525AT"]
[null,null,null,null,null,null,null,null,null,"Tricloroetileno (79-01-6)","Otro"]
[null,null,null,null,null,null,null,null,null,"Tricloroetileno (79-01-6)","Bulk Sample"]
[null,null,null,null,null,null,null,null,null,"Propil acetato (109-60-4)","T. SKC 226-01"]
[null,null,null,null,null,null,null,null,null,"Propil acetato (109-60-4)","T. SKC 226-09"]
[null,null,null,null,null,null,null,null,null,"Propil acetato (109-60-4)","T. ZST-001"]
[null,null,null,null,null,null,null,null,null,"Propil acetato (109-60-4)","T. ZST-002"]
[null,null,null,null,null,null,null,null,null,"Propil acetato (109-60-4)","T. ORBO 32S"]
[null,null,null,null,null,null,null,null,null,"Propil acetato (109-60-4)","T. ORBO 32L"]
[null,null,null,null,null,null,null,null,null,"Propil acetato (109-60-4)","PM SKC 575-001"]
[null,null,null,null,null,null,null,null,null,"Propil acetato (109-60-4)","PM SKC 575-002"]
[null,null,null,null,null,null,null,null,null,"Propil acetato (109-60-4)","PM 525AT"]
[null,null,null,null,null,null,null,null,null,"Propil acetato (109-60-4)","Otro"]
[null,null,null,null,null,null,null,null,null,"Propil acetato (109-60-4)","Bulk Sample"]
[null,null,null,null,null,null,null,null,null,"1,4-Dioxano (123-91-1)","T. SKC 226-01"]
[null,null,null,null,null,null,null,null,null,"1,4-Dioxano (123-91-1)","T. SKC 226-09"]
[null,null,null,null,null,null,null,null,null,"1,4-Dioxano (123-91-1)","T. ZST-001"]
[null,null,null,null,null,null,null,null,null,"1,4-Dioxano (123-91-1)","T. ZST-002"]
[null,null,null,null,null,null,null,null,null,"1,4-Dioxano (123-91-1)","T. ORBO 32S"]
[null,null,null,null,null,null,null,null,null,"1,4-Dioxano (123-91-1)","T. ORBO 32L"]
[null,null,null,null,null,null,null,null,null,"1,4-Dioxano (123-91-1)","PM SKC 575-002"]
[null,null,null,null,null,null,null,null,null,"1,4-Dioxano (123-91-1)","PM 525AT"]
[null,null,null,null,null,null,null,null,null,"1,4-Dioxano (123-91-1)","Otro"]
[null,null,null,null,null,null,null,null,null,"1,4-Dioxano (123-91-1)","Bulk Sample"]
[null,null,null,null,null,null,null,null,null,"4-metil-2-pentanona (108-10-1)","T. SKC 226-01"]
[null,null,null,null,null,null,null,null,null,"4-metil-2-pentanona (108-10-1)","T. SKC 226-09"]
[null,null,null,null,null,null,null,null,null,"4-metil-2-pentanona (108-10-1)","T. ZST-001"]
[null,null,null,null,null,null,null,null,null,"4-metil-2-pentanona (108-10-1)","T. ZST-002"]
[null,null,null,null,null,null,null,null,null,"4-metil-2-pentanona (108-10-1)","T. ORBO 32S"]
[null,null,null,null,null,null,null,null,null,"4-metil-2-pentanona (108-10-1)","T. ORBO 32L"]
[null,null,null,null,null,null,null,null,null,"4-metil-2-pentanona (108-10-1)","PM SKC 575-002"]
[null,null,null,null,null,null,null,null,null,"4-metil-2-pentanona (108-10-1)","PM 525AT"]
[null,null,null,null,null,null,null,null,null,"4-metil-2-pentanona (108-10-1)","Otro"]
[null,null,null,null,null,null,null,null,null,"4-metil-2-pentanona (108-10-1)","Bulk Sample"]
[null,null,null,null,null,null,null,null,null,"Octano (111-65-9)","T. SKC 226-01"]
[null,null,null,null,null,null,null,null,null,"Octano (111-65-9)","T. SKC 226-09"]
[null,null,null,null,null,null,null,null,null,"Octano (111-65-9)","T. ZST-001"]
[null,null,null,null,null,null,null,null,null,"Octano (111-65-9)","T. ZST-002"]
[null,null,null,null,null,null,null,null,null,"Octano (111-65-9)","T. ORBO 32S"]
[null,null,null,null,null,null,null,null,null,"Octano (111-65-9)","T. ORBO 32L"]
[null,null,null,null,null,null,null,null,null,"Octano (111-65-9)","PM SKC 575-001"]
[null,null,null,null,null,null,null,null,null,"Octano (111-65-9)","PM SKC 575-002"]
[null,null,null,null,null,null,null,null,null,"Octano (111-65-9)","PM 525AT"]
[null,null,null,null,null,null,null,null,null,"Octano (111-65-9)","Otro"]
[null,null,null,null,null,null,null,null,null,"Octano (111-65-9)","Bulk Sample"]
[null,null,null,null,null,null,null,null,null,"Tetracloroetileno (127-18-4)","T. SKC 226-01"]
[null,null,null,null,null,null,null,null,null,"Tetracloroetileno (127-18-4)","T. SKC 226-09"]
[null,null,null,null,null,null,null,null,null,"Tetracloroetileno (127-18-4)","T. ZST-001"]
[null,null,null,null,null,null,null,null,null,"Tetracloroetileno (127-18-4)","T. ZST-002"]
[null,null,null,null,null,null,null,null,null,"Tetracloroetileno (127-18-4)","T. ORBO 32S"]
[null,null,null,null,null,null,null,null,null,"Tetracloroetileno (127-18-4)","T. ORBO 32L"]
[null,null,null,null,null,null,null,null,null,"Tetracloroetileno (127-18-4)","PM SKC 575-001"]
[null,null,null,null,null,null,null,null,null,"Tetracloroetileno (127-18-4)","PM SKC 575-002"]
[null,null,null,null,null,null,null,null,null,"Tetracloroetileno (127-18-4)","PM 525AT"]
[null,null,null,null,null,null,null,null,null,"Tetracloroetileno (127-18-4)","Otro"]
[null,null,null,null,null,null,null,null,null,"Tetracloroetileno (127-18-4)","Bulk Sample"]
[null,null,null,null,null,null,null,null,null,"Butilacetato (123-86-4)","T. SKC 226-01"]
[null,null,null,null,null,null,null,null,null,"Butilacetato (123-86-4)","T. SKC 226-09"]
[null,null,null,null,null,null,null,null,null,"Butilacetato (123-86-4)","T. ZST-001"]
[null,null,null,null,null,null,null,null,null,"Butilacetato (123-86-4)","T. ZST-002"]
[null,null,null,null,null,null,null,null,null,"Butilacetato (123-86-4)","T. ORBO 32S"]
[null,null,null,null,null,null,null,null,null,"Butilacetato (123-86-4)","T. ORBO 32L"]
[null,null,null,null,null,null,null,null,null,"Butilacetato (123-86-4)","PM SKC 575-001"]
[null,null,null,null,null,null,null,null,null,"Butilacetato (123-86-4)","PM SKC 575-002"]
[null,null,null,null,null,null,null,null,null,"Butilacetato (123-86-4)","PM 525AT"]
[null,null,null,null,null,null,null,null,null,"Butilacetato (123-86-4)","Otro"]
[null,null,null,null,null,null,null,null,null,"Butilacetato (123-86-4)","Bulk Sample"]
[null,null,null,null,null,null,null,null,null,"Clorobeneno (108-90-7)","T. SKC 226-01"]
[null,null,null,null,null,null,null,null,null,"Clorobeneno (108-90-7)","T. SKC 226-09"]
[null,null,null,null,null,null,null,null,null,"Clorobeneno (108-90-7)","T. ZST-001"]
[null,null,null,null,null,null,null,null,null,"Clorobeneno (108-90-7)","T. ZST-002"]
[null,null,null,null,null,null,null,null,null,"Clorobeneno (108-90-7)","T. ORBO 32S"]
[null,null,null,null,null,null,null,null,null,"Clorobeneno (108-90-7)","T. ORBO 32L"]
[null,null,null,null,null,null,null,null,null,"Clorobeneno (108-90-7)","PM SKC 575-001"]
[null,null,null,null,null,null,null,null,null,"Clorobeneno (108-90-7)","PM SKC 575-002"]
[null,null,null,null,null,null,null,null,null,"Clorobeneno (108-90-7)","PM 525AT"]
[null,null,null,null,null,null,null,null,null,"Clorobeneno (108-90-7)","Otro"]
[null,null,null,null,null,null,null,null,null,"Clorobeneno (108-90-7)","Bulk Sample"]
[null,null,null,null,null,null,null,null,null,"Estireno (100-42-5)","T. SKC 226-01"]
[null,null,null,null,null,null,null,null,null,"Estireno (100-42-5)","T. SKC 226-09"]
[null,null,null,null,null,null,null,null,null,"Estireno (100-42-5)","T. ZST-001"]
[null,null,null,null,null,null,null,null,null,"Estireno (100-42-5)","T. ZST-002"]
[null,null,null,null,null,null,null,null,null,"Estireno (100-42-5)","T. ORBO 32S"]
[null,null,null,null,null,null,null,null,null,"Estireno (100-42-5)","T. ORBO 32L"]
[null,null,null,null,null,null,null,null,null,"Estireno (100-42-5)","PM SKC 575-002"]
[null,null,null,null,null,null,null,null,null,"Estireno (100-42-5)","PM 525AT"]
[null,null,null,null,null,null,null,null,null,"Estireno (100-42-5)","Otro"]
[null,null,null,null,null,null,null,null,null,"Estireno (100-42-5)","Bulk Sample"]
[null,null,null,null,null,null,null,null,null,"Decano (124-18-5)","T. SKC 226-01"]
[null,null,null,null,null,null,null,null,null,"Decano (124-18-5)","T. SKC 226-09"]
[null,null,null,null,null,null,null,null,null,"Decano (124-18-5)","T. ZST-001"]
[null,null,null,null,null,null,null,null,null,"Decano (124-18-5)","T. ZST-002"]
[null,null,null,null,null,null,null,null,null,"Decano (124-18-5)","T. ORBO 32S"]
[null,null,null,null,null,null,null,null,null,"Decano (124-18-5)","T. ORBO 32L"]
[null,null,null,null,null,null,null,null,null,"Decano (124-18-5)","PM SKC 575-002"]
[null,null,null,null,null,null,null,null,null,"Decano (124-18-5)","Otro"]
[null,null,null,null,null,null,null,null,null,"Decano (124-18-5)","Bulk Sample"]
[null,null,null,null,null,null,null,null,null,"1,2,4-trimetilbenceno (95-63-6)","T. SKC 226-01"]
[null,null,null,null,null,null,null,null,null,"1,2,4-trimetilbenceno (95-63-6)","T. SKC 226-09"]
[null,null,null,null,null,null,null,null,null,"1,2,4-trimetilbenceno (95-63-6)","T. ZST-001"]
[null,null,null,null,null,null,null,null,null,"1,2,4-trimetilbenceno (95-63-6)","T. ZST-002"]
[null,null,null,null,null,null,null,null,null,"1,2,4-trimetilbenceno (95-63-6)","T. ORBO 32S"]
[null,null,null,null,null,null,null,null,null,"1,2,4-trimetilbenceno (95-63-6)","T. ORBO 32L"]
[null,null,null,null,null,null,null,null,null,"1,2,4-trimetilbenceno (95-63-6)","PM SKC 575-001"]
[null,null,null,null,null,null,null,null,null,"1,2,4-trimetilbenceno (95-63-6)","PM SKC 575-002"]
[null,null,null,null,null,null,null,null,null,"1,2,4-trimetilbenceno (95-63-6)","PM 525AT"]
[null,null,null,null,null,null,null,null,null,"1,2,4-trimetilbenceno (95-63-6)","PM 546AT"]
[null,null,null,null,null,null,null,null,null,"1,2,4-trimetilbenceno (95-63-6)","PM 566AT"]
[null,null,null,null,null,null,null,null,null,"1,2,4-trimetilbenceno (95-63-6)","Otro"]
[null,null,null,null,null,null,null,null,null,"1,2,4-trimetilbenceno (95-63-6)","Bulk Sample"]
[null,null,null,null,null,null,null,null,null,"Naftaleno (91-20-3)","T. SKC 226-01"]
[null,null,null,null,null,null,null,null,null,"Naftaleno (91-20-3)","T. SKC 226-09"]
[null,null,null,null,null,null,null,null,null,"Naftaleno (91-20-3)","T. ZST-001"]
[null,null,null,null,null,null,null,null,null,"Naftaleno (91-20-3)","T. ZST-002"]
[null,null,null,null,null,null,null,null,null,"Naftaleno (91-20-3)","T. ORBO 32S"]
[null,null,null,null,null,null,null,null,null,"Naftaleno (91-20-3)","T. ORBO 32L"]
[null,null,null,null,null,null,null,null,null,"Naftaleno (91-20-3)","PM 525AT"]
[null,null,null,null,null,null,null,null,null,"Naftaleno (91-20-3)","PM 546AT"]
[null,null,null,null,null,null,null,null,null,"Naftaleno (91-20-3)","PM 566AT"]
[null,null,null,null,null,null,null,null,null,"Naftaleno (91-20-3)","Otro"]
[null,null,null,null,null,null,null,null,null,"Naftaleno (91-20-3)","Bulk Sample"]
[null,null,null,null,null,null,null,null,null,"Ciclohexanona (108-94-1)","T. SKC 226-01"]
[null,null,null,null,null,null,null,null,null,"Ciclohexanona (108-94-1)","T. SKC 226-09"]
[null,null,null,null,null,null,null,null,null,"Ciclohexanona (108-94-1)","T. ZST-001"]
[null,null,null,null,null,null,null,null,null,"Ciclohexanona (108-94-1)","T. ZST-002"]
[null,null,null,null,null,null,null,null,null,"Ciclohexanona (108-94-1)","T. ORBO 32S"]
[null,null,null,null,null,null,null,null,null,"Ciclohexanona (108-94-1)","T. ORBO 32L"]
[null,null,null,null,null,null,null,null,null,"Ciclohexanona (108-94-1)","PM SKC 575-001"]
[null,null,null,null,null,null,null,null,null,"Ciclohexanona (108-94-1)","PM 525AT"]
[null,null,null,null,null,null,null,null,null,"Ciclohexanona (108-94-1)","PM 546AT"]
[null,null,null,null,null,null,null,null,null,"Ciclohexanona (108-94-1)","PM 566AT"]
[null,null,null,null,null,null,null,null,null,"Ciclohexanona (108-94-1)","Otro"]
[null,null,null,null,null,null,null,null,null,"Ciclohexanona (108-94-1)","Bulk Sample"]
[null,null,null,null,null,null,null,null,null,"Cloroformo (67-66-3)","T. SKC 226-01"]
[null,null,null,null,null,null,null,null,null,"Cloroformo (67-66-3)","T. SKC 226-09"]
[null,null,null,null,null,null,null,null,null,"Cloroformo (67-66-3)","T. ZST-001"]
[null,null,null,null,null,null,null,null,null,"Cloroformo (67-66-3)","T. ZST-002"]
[null,null,null,null,null,null,null,null,null,"Cloroformo (67-66-3)","T. ORBO 32S"]
[null,null,null,null,null,null,null,null,null,"Cloroformo (67-66-3)","T. ORBO 32L"]
[null,null,null,null,null,null,null,null,null,"Cloroformo (67-66-3)","PM SKC 575-001"]
[null,null,null,null,null,null,null,null,null,"Cloroformo (67-66-3)","PM 525AT"]
[null,null,null,null,null,null,null,null,null,"Cloroformo (67-66-3)","PM 546AT"]
[null,null,null,null,null,null,null,null,null,"Cloroformo (67-66-3)","PM 566AT"]
[null,null,null,null,null,null,null,null,null,"Cloroformo (67-66-3)","Otro"]
[null,null,null,null,null,null,null,null,null,"Cloroformo (67-66-3)","Bulk Sample"]
[null,null,null,null,null,null,null,null,null,"Etanol (64-17-5)","T. SKC 226-01"]
[null,null,null,null,null,null,null,null,null,"Etanol (64-17-5)","T. SKC 226-09"]
[null,null,null,null,null,null,null,null,null,"Etanol (64-17-5)","T. ZST-001"]
[null,null,null,null,null,null,null,null,null,"Etanol (64-17-5)","T. ZST-002"]
[null,null,null,null,null,null,null,null,null,"Etanol (64-17-5)","T. ORBO 32S"]
[null,null,null,null,null,null,null,null,null,"Etanol (64-17-5)","T. ORBO 32L"]
[null,null,null,null,null,null,null,null,null,"Etanol (64-17-5)","PM SKC 575-002"]
[null,null,null,null,null,null,null,null,null,"Etanol (64-17-5)","PM 525AT"]
[null,null,null,null,null,null,null,null,null,"Etanol (64-17-5)","PM 546AT"]
[null,null,null,null,null,null,null,null,null,"Etanol (64-17-5)","PM 566AT"]
[null,null,null,null,null,null,null,null,null,"Etanol (64-17-5)","Otro"]
[null,null,null,null,null,null,null,null,null,"Etanol (64-17-5)","Bulk Sample"]
[null,null,null,null,null,null,null,null,null,"Isopropanol (67-63-0)","T. SKC 226-01"]
[null,null,null,null,null,null,null,null,null,"Isopropanol (67-63-0)","T. SKC 226-09"]
[null,null,null,null,null,null,null,null,null,"Isopropanol (67-63-0)","T. ZST-001"]
[null,null,null,null,null,null,null,null,null,"Isopropanol (67-63-0)","T. ZST-002"]
[null,null,null,null,null,null,null,null,null,"Isopropanol (67-63-0)","T. ORBO 32S"]
[null,null,null,null,null,null,null,null,null,"Isopropanol (67-63-0)","T. ORBO 32L"]
[null,null,null,null,null,null,null,null,null,"Isopropanol (67-63-0)","PM SKC 575-002"]
[null,null,null,null,null,null,null,null,null,"Isopropanol (67-63-0)","PM 525AT"]
[null,null,null,null,null,null,null,null,null,"Isopropanol (67-63-0)","PM 546AT"]
[null,null,null,null,null,null,null,null,null,"Isopropanol (67-63-0)","PM 566AT"]
[null,null,null,null,null,null,null,null,null,"Isopropanol (67-63-0)","Otro"]
[null,null,null,null,null,null,null,null,null,"Isopropanol (67-63-0)","Bulk Sample"]
[null,null,null,null,null,null,null,null,null,"n-propanol (71-23-8)","T. SKC 226-01"]
[null,null,null,null,null,null,null,null,null,"n-propanol (71-23-8)","T. SKC 226-09"]
[null,null,null,null,null,null,null,null,null,"n-propanol (71-23-8)","T. ZST-001"]
[null,null,null,null,null,null,null,null,null,"n-propanol (71-23-8)","T. ZST-002"]
[null,null,null,null,null,null,null,null,null,"n-propanol (71-23-8)","T. ORBO 32S"]
[null,null,null,null,null,null,null,null,null,"n-propanol (71-23-8)","T. ORBO 32L"]
[null,null,null,null,null,null,null,null,null,"n-propanol (71-23-8)","PM SKC 575-001"]
[null,null,null,null,null,null,null,null,null,"n-propanol (71-23-8)","PM SKC 575-002"]
[null,null,null,null,null,null,null,null,null,"n-propanol (71-23-8)","PM 525AT"]
[null,null,null,null,null,null,null,null,null,"n-propanol (71-23-8)","PM 546AT"]
[null,null,null,null,null,null,null,null,null,"n-propanol (71-23-8)","PM 566AT"]
[null,null,null,null,null,null,null,null,null,"n-propanol (71-23-8)","Otro"]
[null,null,null,null,null,null,null,null,null,"n-propanol (71-23-8)","Bulk Sample"]
[null,null,null,null,null,null,null,null,null,"2-butanol (4221-99-2)","T. SKC 226-01"]
[null,null,null,null,null,null,null,null,null,"2-butanol (4221-99-2)","T. SKC 226-09"]
[null,null,null,null,null,null,null,null,null,"2-butanol (4221-99-2)","T. ZST-001"]
[null,null,null,null,null,null,null,null,null,"2-butanol (4221-99-2)","T. ZST-002"]
[null,null,null,null,null,null,null,null,null,"2-butanol (4221-99-2)","T. ORBO 32S"]
[null,null,null,null,null,null,null,null,null,"2-butanol (4221-99-2)","T. ORBO 32L"]
[null,null,null,null,null,null,null,null,null,"2-butanol (4221-99-2)","Otro"]
[null,null,null,null,null,null,null,null,null,"2-butanol (4221-99-2)","Bulk Sample"]
[null,null,null,null,null,null,null,null,null,"1-butanol (71-36-3)","T. SKC 226-01"]
[null,null,null,null,null,null,null,null,null,"1-butanol (71-36-3)","T. SKC 226-09"]
[null,null,null,null,null,null,null,null,null,"1-butanol (71-36-3)","T. ZST-001"]
[null,null,null,null,null,null,null,null,null,"1-butanol (71-36-3)","T. ZST-002"]
[null,null,null,null,null,null,null,null,null,"1-butanol (71-36-3)","T. ORBO 32S"]
[null,null,null,null,null,null,null,null,null,"1-butanol (71-36-3)","T. ORBO 32L"]
[null,null,null,null,null,null,null,null,null,"1-butanol (71-36-3)","PM SKC 575-001"]
[null,null,null,null,null,null,null,null,null,"1-butanol (71-36-3)","PM SKC 575-002"]
[null,null,null,null,null,null,null,null,null,"1-butanol (71-36-3)","PM 525AT"]
[null,null,null,null,null,null,null,null,null,"1-butanol (71-36-3)","PM 546AT"]
[null,null,null,null,null,null,null,null,null,"1-butanol (71-36-3)","PM 566AT"]
[null,null,null,null,null,null,null,null,null,"1-butanol (71-36-3)","Otro"]
[null,null,null,null,null,null,null,null,null,"1-butanol (71-36-3)","Bulk Sample"]
[null,null,null,null,null,null,null,null,null,"Éter de petróleo (8032-32-4)","T. SKC 226-01"]
[null,null,null,null,null,null,null,null,null,"Éter de petróleo (8032-32-4)","T. SKC 226-09"]
[null,null,null,null,null,null,null,null,null,"Éter de petróleo (8032-32-4)","T. ZST-001"]
[null,null,null,null,null,null,null,null,null,"Éter de petróleo (8032-32-4)","T. ZST-002"]
[null,null,null,null,null,null,null,null,null,"Éter de petróleo (8032-32-4)","T. ORBO 32S"]
[null,null,null,null,null,null,null,null,null,"Éter de petróleo (8032-32-4)","T. ORBO 32L"]
[null,null,null,null,null,null,null,null,null,"Éter de petróleo (8032-32-4)","PM 525AT"]
[null,null,null,null,null,null,null,null,null,"Éter de petróleo (8032-32-4)","PM 546AT"]
[null,null,null,null,null,null,null,null,null,"Éter de petróleo (8032-32-4)","PM 566AT"]
[null,null,null,null,null,null,null,null,null,"Éter de petróleo (8032-32-4)","Otro"]
[null,null,null,null,null,null,null,null,null,"Éter de petróleo (8032-32-4)","Bulk Sample"]
[null,null,null,null,null,null,null,null,null,"Rubber solvent (8030-30-6)","T. SKC 226-01"]
[null,null,null,null,null,null,null,null,null,"Rubber solvent (8030-30-6)","T. SKC 226-09"]
[null,null,null,null,null,null,null,null,null,"Rubber solvent (8030-30-6)","T. ZST-001"]
[null,null,null,null,null,null,null,null,null,"Rubber solvent (8030-30-6)","T. ZST-002"]
[null,null,null,null,null,null,null,null,null,"Rubber solvent (8030-30-6)","T. ORBO 32S"]
[null,null,null,null,null,null,null,null,null,"Rubber solvent (8030-30-6)","T. ORBO 32L"]
[null,null,null,null,null,null,null,null,null,"Rubber solvent (8030-30-6)","Otro"]
[null,null,null,null,null,null,null,null,null,"Rubber solvent (8030-30-6)","Bulk Sample"]
[null,null,null,null,null,null,null,null,null,"Nafta de petróleo (8002-05-9)","T. SKC 226-01"]
[null,null,null,null,null,null,null,null,null,"Nafta de petróleo (8002-05-9)","T. SKC 226-09"]
[null,null,null,null,null,null,null,null,null,"Nafta de petróleo (8002-05-9)","T. ZST-001"]
[null,null,null,null,null,null,null,null,null,"Nafta de petróleo (8002-05-9)","T. ZST-002"]
[null,null,null,null,null,null,null,null,null,"Nafta de petróleo (8002-05-9)","T. ORBO 32S"]
[null,null,null,null,null,null,null,null,null,"Nafta de petróleo (8002-05-9)","T. ORBO 32L"]
[null,null,null,null,null,null,null,null,null,"Nafta de petróleo (8002-05-9)","Otro"]
[null,null,null,null,null,null,null,null,null,"Nafta de petróleo (8002-05-9)","Bulk Sample"]
[null,null,null,null,null,null,null,null,null,"VM&P naphtha (8032-32-4)","T. SKC 226-01"]
[null,null,null,null,null,null,null,null,null,"VM&P naphtha (8032-32-4)","T. SKC 226-09"]
[null,null,null,null,null,null,null,null,null,"VM&P naphtha (8032-32-4)","T. ZST-001"]
[null,null,null,null,null,null,null,null,null,"VM&P naphtha (8032-32-4)","T. ZST-002"]
[null,null,null,null,null,null,null,null,null,"VM&P naphtha (8032-32-4)","T. ORBO 32S"]
[null,null,null,null,null,null,null,null,null,"VM&P naphtha (8032-32-4)","T. ORBO 32L"]
[null,null,null,null,null,null,null,null,null,"VM&P naphtha (8032-32-4)","PM 525AT"]
[null,null,null,null,null,null,null,null,null,"VM&P naphtha (8032-32-4)","PM 546AT"]
[null,null,null,null,null,null,null,null,null,"VM&P naphtha (8032-32-4)","PM 566AT"]
[null,null,null,null,null,null,null,null,null,"VM&P naphtha (8032-32-4)","Otro"]
[null,null,null,null,null,null,null,null,null,"VM&P naphtha (8032-32-4)","Bulk Sample"]
[null,null,null,null,null,null,null,null,null,"Mineral spirits (8052-41-3)","T. SKC 226-01"]
[null,null,null,null,null,null,null,null,null,"Mineral spirits (8052-41-3)","T. SKC 226-09"]
[null,null,null,null,null,null,null,null,null,"Mineral spirits (8052-41-3)","T. ZST-001"]
[null,null,null,null,null,null,null,null,null,"Mineral spirits (8052-41-3)","T. ZST-002"]
[null,null,null,null,null,null,null,null,null,"Mineral spirits (8052-41-3)","T. ORBO 32S"]
[null,null,null,null,null,null,null,null,null,"Mineral spirits (8052-41-3)","T. ORBO 32L"]
[null,null,null,null,null,null,null,null,null,"Mineral spirits (8052-41-3)","PM SKC 575-001"]
[null,null,null,null,null,null,null,null,null,"Mineral spirits (8052-41-3)","PM 525AT"]
[null,null,null,null,null,null,null,null,null,"Mineral spirits (8052-41-3)","PM 546AT"]
[null,null,null,null,null,null,null,null,null,"Mineral spirits (8052-41-3)","PM 566AT"]
[null,null,null,null,null,null,null,null,null,"Mineral spirits (8052-41-3)","Otro"]
[null,null,null,null,null,null,null,null,null,"Mineral spirits (8052-41-3)","Bulk Sample"]
[null,null,null,null,null,null,null,null,null,"Stoddard solvent (8052-41-3)","T. SKC 226-01"]
[null,null,null,null,null,null,null,null,null,"Stoddard solvent (8052-41-3)","T. SKC 226-09"]
[null,null,null,null,null,null,null,null,null,"Stoddard solvent (8052-41-3)","T. ZST-001"]
[null,null,null,null,null,null,null,null,null,"Stoddard solvent (8052-41-3)","T. ZST-002"]
[null,null,null,null,null,null,null,null,null,"Stoddard solvent (8052-41-3)","T. ORBO 32S"]
[null,null,null,null,null,null,null,null,null,"Stoddard solvent (8052-41-3)","T. ORBO 32L"]
[null,null,null,null,null,null,null,null,null,"Stoddard solvent (8052-41-3)","PM SKC 575-001"]
[null,null,null,null,null,null,null,null,null,"Stoddard solvent (8052-41-3)","PM 525AT"]
[null,null,null,null,null,null,null,null,null,"Stoddard solvent (8052-41-3)","PM 546AT"]
[null,null,null,null,null,null,null,null,null,"Stoddard solvent (8052-41-3)","PM 566AT"]
[null,null,null,null,null,null,null,null,null,"Stoddard solvent (8052-41-3)","Otro"]
[null,null,null,null,null,null,null,null,null,"Stoddard solvent (8052-41-3)","Bulk Sample"]
[null,null,null,null,null,null,null,null,null,"Kerosene (8008-20-6)","T. SKC 226-01"]
[null,null,null,null,null,null,null,null,null,"Kerosene (8008-20-6)","T. SKC 226-09"]
[null,null,null,null,null,null,null,null,null,"Kerosene (8008-20-6)","T. ZST-001"]
[null,null,null,null,null,null,null,null,null,"Kerosene (8008-20-6)","T. ZST-002"]
[null,null,null,null,null,null,null,null,null,"Kerosene (8008-20-6)","T. ORBO 32S"]
[null,null,null,null,null,null,null,null,null,"Kerosene (8008-20-6)","T. ORBO 32L"]
[null,null,null,null,null,null,null,null,null,"Kerosene (8008-20-6)","Otro"]
[null,null,null,null,null,null,null,null,null,"Kerosene (8008-20-6)","Bulk Sample"]
[null,null,null,null,null,null,null,null,null,"Coal tar naphtha (8030-30-6)","T. SKC 226-01"]
[null,null,null,null,null,null,null,null,null,"Coal tar naphtha (8030-30-6)","T. SKC 226-09"]
[null,null,null,null,null,null,null,null,null,"Coal tar naphtha (8030-30-6)","T. ZST-001"]
[null,null,null,null,null,null,null,null,null,"Coal tar naphtha (8030-30-6)","T. ZST-002"]
[null,null,null,null,null,null,null,null,null,"Coal tar naphtha (8030-30-6)","T. ORBO 32S"]
[null,null,null,null,null,null,null,null,null,"Coal tar naphtha (8030-30-6)","T. ORBO 32L"]
[null,null,null,null,null,null,null,null,null,"Coal tar naphtha (8030-30-6)","Otro"]
[null,null,null,null,null,null,null,null,null,"Coal tar naphtha (8030-30-6)","Bulk Sample"]
[null,null,null,null,null,null,null,null,null,"Gasolina (8006-61-9)","T. SKC 226-01"]
[null,null,null,null,null,null,null,null,null,"Gasolina (8006-61-9)","T. SKC 226-09"]
[null,null,null,null,null,null,null,null,null,"Gasolina (8006-61-9)","T. ZST-001"]
[null,null,null,null,null,null,null,null,null,"Gasolina (8006-61-9)","T. ZST-002"]
[null,null,null,null,null,null,null,null,null,"Gasolina (8006-61-9)","T. ORBO 32S"]
[null,null,null,null,null,null,null,null,null,"Gasolina (8006-61-9)","T. ORBO 32L"]
[null,null,null,null,null,null,null,null,null,"Gasolina (8006-61-9)","Otro"]
[null,null,null,null,null,null,null,null,null,"Gasolina (8006-61-9)","Bulk Sample"]
[null,null,null,null,null,null,null,null,null,"Acrilonitrilo (107-13-1)","T. SKC 226-01"]
[null,null,null,null,null,null,null,null,null,"Acrilonitrilo (107-13-1)","T. SKC 226-09"]
[null,null,null,null,null,null,null,null,null,"Acrilonitrilo (107-13-1)","T. ZST-001"]
[null,null,null,null,null,null,null,null,null,"Acrilonitrilo (107-13-1)","T. ZST-002"]
[null,null,null,null,null,null,null,null,null,"Acrilonitrilo (107-13-1)","T. ORBO 32S"]
[null,null,null,null,null,null,null,null,null,"Acrilonitrilo (107-13-1)","T. ORBO 32L"]
[null,null,null,null,null,null,null,null,null,"Acrilonitrilo (107-13-1)","PM SKC 575-001"]
[null,null,null,null,null,null,null,null,null,"Acrilonitrilo (107-13-1)","PM SKC 575-002"]
[null,null,null,null,null,null,null,null,null,"Acrilonitrilo (107-13-1)","PM 525AT"]
[null,null,null,null,null,null,null,null,null,"Acrilonitrilo (107-13-1)","PM 546AT"]
[null,null,null,null,null,null,null,null,null,"Acrilonitrilo (107-13-1)","PM 566AT"]
[null,null,null,null,null,null,null,null,null,"Acrilonitrilo (107-13-1)","Otro"]
[null,null,null,null,null,null,null,null,null,"Acrilonitrilo (107-13-1)","Bulk Sample"]
[null,null,null,null,null,null,null,null,null,"Metanol (67-56-1)","T. SKC 226-10"]
[null,null,null,null,null,null,null,null,null,"Metanol (67-56-1)","T. SKC 226-15"]
[null,null,null,null,null,null,null,null,null,"Metanol (67-56-1)","T. ZST-050"]
[null,null,null,null,null,null,null,null,null,"Metanol (67-56-1)","T. ZST-054"]
[null,null,null,null,null,null,null,null,null,"Metanol (67-56-1)","T. ORBO 52 S"]
[null,null,null,null,null,null,null,null,null,"Metanol (67-56-1)","T. ORBO 507 "]
[null,null,null,null,null,null,null,null,null,"Ácido fórmico (64-18-6)","T. SKC 226-10-03"]
[null,null,null,null,null,null,null,null,null,"Ácido fórmico (64-18-6)","T. ORBO 53"]
[null,null,null,null,null,null,null,null,null,"Glutaraldehido  (111-30-8)","T. SKC 226-117"]
[null,null,null,null,null,null,null,null,null,"Glutaraldehido  (111-30-8)","T. ZST-085"]
[null,null,null,null,null,null,null,null,null,"Glutaraldehido  (111-30-8)","T. ORBO 24"]
[null,null,null,null,null,null,null,null,null,"Glutaraldehido  (111-30-8)","T. SKC 226-119"]
[null,null,null,null,null,null,null,null,null,"Glutaraldehido  (111-30-8)","T.  ZST-055"]
[null,null,null,null,null,null,null,null,null,"Formaldehido (50-00-0)","T. SKC 226-117"]
[null,null,null,null,null,null,null,null,null,"Formaldehido (50-00-0)","T. ZST-085"]
[null,null,null,null,null,null,null,null,null,"Formaldehido (50-00-0)","T. ORBO 24"]
[null,null,null,null,null,null,null,null,null,"Material particulado total","F. Cap. PVC 37 mm PW, 5 µm"]
[null,null,null,null,null,null,null,null,null,"DPM  (7440-44-0)","F. Cuarzo 37 mm"]
[null,null,null,null,null,null,null,null,null,"DPM  (7440-44-0)","F. Cuarzo 25 mm"]
[null,null,null,null,null,null,null,null,null,"DPM  (7440-44-0)","F. Cuarzo 47 mm"]
[null,null,null,null,null,null,null,null,null,"PAH's","F. PTFE 37mm, 2-µm + washed XAD-2"]
[null,null,null,null,null,null,null,null,null,"Acenafteno ( 83-32-9)","F. PTFE 37mm, 2-µm + washed XAD-2"]
[null,null,null,null,null,null,null,null,null,"Acenaftileno (208-96-8)","F. PTFE 37mm, 2-µm + washed XAD-2"]
[null,null,null,null,null,null,null,null,null,"Antraceno (120-12-7)","F. PTFE 37mm, 2-µm + washed XAD-2"]
[null,null,null,null,null,null,null,null,null,"Benz[a]antraceno (56-55-3)","F. PTFE 37mm, 2-µm + washed XAD-2"]
[null,null,null,null,null,null,null,null,null,"Benzo[e]acefenantrileno (205-99-2)","F. PTFE 37mm, 2-µm + washed XAD-2"]
[null,null,null,null,null,null,null,null,null,"Benzo[k]fluoranteno (207-08-9)","F. PTFE 37mm, 2-µm + washed XAD-2"]
[null,null,null,null,null,null,null,null,null,"Benzo(g,h,i)perileno (191-24-2)","F. PTFE 37mm, 2-µm + washed XAD-2"]
[null,null,null,null,null,null,null,null,null,"Benzopireno (50-32-8)","F. PTFE 37mm, 2-µm + washed XAD-2"]
[null,null,null,null,null,null,null,null,null,"Benzo[e]pyrene ( 192-97-2)","F. PTFE 37mm, 2-µm + washed XAD-2"]
[null,null,null,null,null,null,null,null,null,"Criseno (218-01-9)","F. PTFE 37mm, 2-µm + washed XAD-2"]
[null,null,null,null,null,null,null,null,null,"Dibenzo[a,h]antraceno ( 53-70-3)","F. PTFE 37mm, 2-µm + washed XAD-2"]
[null,null,null,null,null,null,null,null,null,"Fluoranteno (206-44-0)","F. PTFE 37mm, 2-µm + washed XAD-2"]
[null,null,null,null,null,null,null,null,null,"Fluoreno (86-73-7)","F. PTFE 37mm, 2-µm + washed XAD-2"]
[null,null,null,null,null,null,null,null,null,"Indeno(1,2,3-cd)pireno (193-39-5)","F. PTFE 37mm, 2-µm + washed XAD-2"]
[null,null,null,null,null,null,null,null,null,"Naftaleno (91-20-3)","F. PTFE 37mm, 2-µm + washed XAD-2"]
[null,null,null,null,null,null,null,null,null,"Fenantreno ( 85-01-8)","F. PTFE 37mm, 2-µm + washed XAD-2"]
[null,null,null,null,null,null,null,null,null,"Pireno (129-00-0)","F. PTFE 37mm, 2-µm + washed XAD-2"]
[null,null,null,null,null,null,null,null,null,"Dióxido de azufre (7446-09-5)","F. MCE 37 mm tratado"]
[null,null,null,null,null,null,null,null,null,"Mercurio (7439-97-6)","T. SKC 226-17-1A"]
[null,null,null,null,null,null,null,null,null,"Mercurio (7439-97-6)","T. ZST-040"]
[null,null,null,null,null,null,null,null,null,"Mercurio (7439-97-6)","T. ZST-041"]
[null,null,null,null,null,null,null,null,null,"Mercurio (7439-97-6)","F. MCE 37 mm, 0.8 µm"]
[null,null,null,null,null,null,null,null,null,"Mercurio (7439-97-6)","F. MCE 25 mm, 0.8 µm"]
[null,null,null,null,null,null,null,null,null,"Mercurio (7439-97-6)","PM SKC 520-02"]
[null,null,null,null,null,null,null,null,null,"Mercurio (7439-97-6)","PM 593AT"]
[null,null,null,null,null,null,null,null,null,"Bromo (7726-95-6)","F. Plata 25 mm lavada, 0.45 µm"]
[null,null,null,null,null,null,null,null,null,"Cloro (7782-50-5)","F. Plata 25 mm lavada, 0.45 µm"]
[null,null,null,null,null,null,null,null,null,"Sulfuro de hidrógeno (7783-06-4)","T. ORBO 34"]
[null,null,null,null,null,null,null,null,null,"Amoniaco (7664-41-7)","T. SKC 226-10-06"]
[null,null,null,null,null,null,null,null,null,"Perfil metalico (21)","F. MCE 37 mm, 0.8 µm"]
[null,null,null,null,null,null,null,null,null,"Perfil metalico (21)","F. MCE 25 mm, 0.8 µm"]
[null,null,null,null,null,null,null,null,null,"Perfil metalico (21)","F. MCE 37 mm PW, 0.8 µm"]
[null,null,null,null,null,null,null,null,null,"Perfil metalico (21)","F. Cap. MCE 37 mm PW, 0.8 µm"]
[null,null,null,null,null,null,null,null,null,"Perfil metalico (21)","F. MCE 37 mm PW, 0.8 µm"]
[null,null,null,null,null,null,null,null,null,"Perfil metalico (21)","F. PVC 37 mm PW, 5 µm"]
[null,null,null,null,null,null,null,null,null,"Perfil metalico (21)","F. Cap. PVC 37 mm PW, 5 µm"]
[null,null,null,null,null,null,null,null,null,"Perfil metalico (21)","F. PVC 25 mm PW, 5 µm"]
[null,null,null,null,null,null,null,null,null,"Perfil metalico (21)","Bulk Sample"]
[null,null,null,null,null,null,null,null,null,"Humos de soldadura (15)","F. MCE 37 mm, 0.8 µm"]
[null,null,null,null,null,null,null,null,null,"Humos de soldadura (15)","F. MCE 25 mm, 0.8 µm"]
[null,null,null,null,null,null,null,null,null,"Humos de soldadura (15)","F. MCE 37 mm PW, 0.8 µm"]
[null,null,null,null,null,null,null,null,null,"Humos de soldadura (15)","F. Cap. MCE 37 mm PW, 0.8 µm"]
[null,null,null,null,null,null,null,null,null,"Humos de soldadura (15)","F. MCE 37 mm PW, 0.8 µm"]
[null,null,null,null,null,null,null,null,null,"Humos de soldadura (15)","F. PVC 37 mm PW, 5 µm"]
[null,null,null,null,null,null,null,null,null,"Humos de soldadura (15)","F. Cap. PVC 37 mm PW, 5 µm"]
[null,null,null,null,null,null,null,null,null,"Humos de soldadura (15)","F. PVC 25 mm PW, 5 µm"]
[null,null,null,null,null,null,null,null,null,"Humos de soldadura (15)","Bulk Sample"]
[null,null,null,null,null,null,null,null,null,"Aluminio (Al)","F. MCE 37 mm, 0.8 µm"]
[null,null,null,null,null,null,null,null,null,"Aluminio (Al)","F. MCE 25 mm, 0.8 µm"]
[null,null,null,null,null,null,null,null,null,"Aluminio (Al)","F. MCE 37 mm PW, 0.8 µm"]
[null,null,null,null,null,null,null,null,null,"Aluminio (Al)","F. Cap. MCE 37 mm PW, 0.8 µm"]
[null,null,null,null,null,null,null,null,null,"Aluminio (Al)","F. MCE 37 mm PW, 0.8 µm"]
[null,null,null,null,null,null,null,null,null,"Aluminio (Al)","F. PVC 37 mm PW, 5 µm"]
[null,null,null,null,null,null,null,null,null,"Aluminio (Al)","F. Cap. PVC 37 mm PW, 5 µm"]
[null,null,null,null,null,null,null,null,null,"Aluminio (Al)","F. PVC 25 mm PW, 5 µm"]
[null,null,null,null,null,null,null,null,null,"Aluminio (Al)","Bulk Sample"]
[null,null,null,null,null,null,null,null,null,"Plata (Ag)","F. MCE 37 mm, 0.8 µm"]
[null,null,null,null,null,null,null,null,null,"Plata (Ag)","F. MCE 25 mm, 0.8 µm"]
[null,null,null,null,null,null,null,null,null,"Plata (Ag)","F. MCE 37 mm PW, 0.8 µm"]
[null,null,null,null,null,null,null,null,null,"Plata (Ag)","F. Cap. MCE 37 mm PW, 0.8 µm"]
[null,null,null,null,null,null,null,null,null,"Plata (Ag)","F. MCE 37 mm PW, 0.8 µm"]
[null,null,null,null,null,null,null,null,null,"Plata (Ag)","F. PVC 37 mm PW, 5 µm"]
[null,null,null,null,null,null,null,null,null,"Plata (Ag)","F. Cap. PVC 37 mm PW, 5 µm"]
[null,null,null,null,null,null,null,null,null,"Plata (Ag)","F. PVC 25 mm PW, 5 µm"]
[null,null,null,null,null,null,null,null,null,"Plata (Ag)","Bulk Sample"]
[null,null,null,null,null,null,null,null,null,"Arsénico (As)","F. MCE 37 mm, 0.8 µm"]
[null,null,null,null,null,null,null,null,null,"Arsénico (As)","F. MCE 25 mm, 0.8 µm"]
[null,null,null,null,null,null,null,null,null,"Arsénico (As)","F. MCE 37 mm PW, 0.8 µm"]
[null,null,null,null,null,null,null,null,null,"Arsénico (As)","F. Cap. MCE 37 mm PW, 0.8 µm"]
[null,null,null,null,null,null,null,null,null,"Arsénico (As)","F. MCE 37 mm PW, 0.8 µm"]
[null,null,null,null,null,null,null,null,null,"Arsénico (As)","F. PVC 37 mm PW, 5 µm"]
[null,null,null,null,null,null,null,null,null,"Arsénico (As)","F. Cap. PVC 37 mm PW, 5 µm"]
[null,null,null,null,null,null,null,null,null,"Arsénico (As)","F. PVC 25 mm PW, 5 µm"]
[null,null,null,null,null,null,null,null,null,"Arsénico (As)","Bulk Sample"]
[null,null,null,null,null,null,null,null,null,"Bario (Ba)","F. MCE 37 mm, 0.8 µm"]
[null,null,null,null,null,null,null,null,null,"Bario (Ba)","F. MCE 25 mm, 0.8 µm"]
[null,null,null,null,null,null,null,null,null,"Bario (Ba)","F. MCE 37 mm PW, 0.8 µm"]
[null,null,null,null,null,null,null,null,null,"Bario (Ba)","F. Cap. MCE 37 mm PW, 0.8 µm"]
[null,null,null,null,null,null,null,null,null,"Bario (Ba)","F. MCE 37 mm PW, 0.8 µm"]
[null,null,null,null,null,null,null,null,null,"Bario (Ba)","F. PVC 37 mm PW, 5 µm"]
[null,null,null,null,null,null,null,null,null,"Bario (Ba)","F. Cap. PVC 37 mm PW, 5 µm"]
[null,null,null,null,null,null,null,null,null,"Bario (Ba)","F. PVC 25 mm PW, 5 µm"]
[null,null,null,null,null,null,null,null,null,"Bario (Ba)","Bulk Sample"]
[null,null,null,null,null,null,null,null,null,"Berilio (Be)","F. MCE 37 mm, 0.8 µm"]
[null,null,null,null,null,null,null,null,null,"Berilio (Be)","F. MCE 25 mm, 0.8 µm"]
[null,null,null,null,null,null,null,null,null,"Berilio (Be)","F. MCE 37 mm PW, 0.8 µm"]
[null,null,null,null,null,null,null,null,null,"Berilio (Be)","F. Cap. MCE 37 mm PW, 0.8 µm"]
[null,null,null,null,null,null,null,null,null,"Berilio (Be)","F. MCE 37 mm PW, 0.8 µm"]
[null,null,null,null,null,null,null,null,null,"Berilio (Be)","F. PVC 37 mm PW, 5 µm"]
[null,null,null,null,null,null,null,null,null,"Berilio (Be)","F. Cap. PVC 37 mm PW, 5 µm"]
[null,null,null,null,null,null,null,null,null,"Berilio (Be)","F. PVC 25 mm PW, 5 µm"]
[null,null,null,null,null,null,null,null,null,"Berilio (Be)","Bulk Sample"]
[null,null,null,null,null,null,null,null,null,"Boro (B)","F. MCE 37 mm, 0.8 µm"]
[null,null,null,null,null,null,null,null,null,"Boro (B)","F. MCE 25 mm, 0.8 µm"]
[null,null,null,null,null,null,null,null,null,"Boro (B)","F. MCE 37 mm PW, 0.8 µm"]
[null,null,null,null,null,null,null,null,null,"Boro (B)","F. Cap. MCE 37 mm PW, 0.8 µm"]
[null,null,null,null,null,null,null,null,null,"Boro (B)","F. MCE 37 mm PW, 0.8 µm"]
[null,null,null,null,null,null,null,null,null,"Boro (B)","F. PVC 37 mm PW, 5 µm"]
[null,null,null,null,null,null,null,null,null,"Boro (B)","F. Cap. PVC 37 mm PW, 5 µm"]
[null,null,null,null,null,null,null,null,null,"Boro (B)","F. PVC 25 mm PW, 5 µm"]
[null,null,null,null,null,null,null,null,null,"Boro (B)","Bulk Sample"]
[null,null,null,null,null,null,null,null,null,"Calcio (Ca)","F. MCE 37 mm, 0.8 µm"]
[null,null,null,null,null,null,null,null,null,"Calcio (Ca)","F. MCE 25 mm, 0.8 µm"]
[null,null,null,null,null,null,null,null,null,"Calcio (Ca)","F. MCE 37 mm PW, 0.8 µm"]
[null,null,null,null,null,null,null,null,null,"Calcio (Ca)","F. Cap. MCE 37 mm PW, 0.8 µm"]
[null,null,null,null,null,null,null,null,null,"Calcio (Ca)","F. MCE 37 mm PW, 0.8 µm"]
[null,null,null,null,null,null,null,null,null,"Calcio (Ca)","F. PVC 37 mm PW, 5 µm"]
[null,null,null,null,null,null,null,null,null,"Calcio (Ca)","F. Cap. PVC 37 mm PW, 5 µm"]
[null,null,null,null,null,null,null,null,null,"Calcio (Ca)","F. PVC 25 mm PW, 5 µm"]
[null,null,null,null,null,null,null,null,null,"Calcio (Ca)","Bulk Sample"]
[null,null,null,null,null,null,null,null,null,"Cobre (Cu)","F. MCE 37 mm, 0.8 µm"]
[null,null,null,null,null,null,null,null,null,"Cobre (Cu)","F. MCE 25 mm, 0.8 µm"]
[null,null,null,null,null,null,null,null,null,"Cobre (Cu)","F. MCE 37 mm PW, 0.8 µm"]
[null,null,null,null,null,null,null,null,null,"Cobre (Cu)","F. Cap. MCE 37 mm PW, 0.8 µm"]
[null,null,null,null,null,null,null,null,null,"Cobre (Cu)","F. MCE 37 mm PW, 0.8 µm"]
[null,null,null,null,null,null,null,null,null,"Cobre (Cu)","F. PVC 37 mm PW, 5 µm"]
[null,null,null,null,null,null,null,null,null,"Cobre (Cu)","F. Cap. PVC 37 mm PW, 5 µm"]
[null,null,null,null,null,null,null,null,null,"Cobre (Cu)","F. PVC 25 mm PW, 5 µm"]
[null,null,null,null,null,null,null,null,null,"Cobre (Cu)","Bulk Sample"]
[null,null,null,null,null,null,null,null,null,"Cadmio (Cd)","F. MCE 37 mm, 0.8 µm"]
[null,null,null,null,null,null,null,null,null,"Cadmio (Cd)","F. MCE 25 mm, 0.8 µm"]
[null,null,null,null,null,null,null,null,null,"Cadmio (Cd)","F. MCE 37 mm PW, 0.8 µm"]
[null,null,null,null,null,null,null,null,null,"Cadmio (Cd)","F. Cap. MCE 37 mm PW, 0.8 µm"]
[null,null,null,null,null,null,null,null,null,"Cadmio (Cd)","F. MCE 37 mm PW, 0.8 µm"]
[null,null,null,null,null,null,null,null,null,"Cadmio (Cd)","F. PVC 37 mm PW, 5 µm"]
[null,null,null,null,null,null,null,null,null,"Cadmio (Cd)","F. Cap. PVC 37 mm PW, 5 µm"]
[null,null,null,null,null,null,null,null,null,"Cadmio (Cd)","F. PVC 25 mm PW, 5 µm"]
[null,null,null,null,null,null,null,null,null,"Cadmio (Cd)","Bulk Sample"]
[null,null,null,null,null,null,null,null,null,"Cobalto (Co)","F. MCE 37 mm, 0.8 µm"]
[null,null,null,null,null,null,null,null,null,"Cobalto (Co)","F. MCE 25 mm, 0.8 µm"]
[null,null,null,null,null,null,null,null,null,"Cobalto (Co)","F. MCE 37 mm PW, 0.8 µm"]
[null,null,null,null,null,null,null,null,null,"Cobalto (Co)","F. Cap. MCE 37 mm PW, 0.8 µm"]
[null,null,null,null,null,null,null,null,null,"Cobalto (Co)","F. MCE 37 mm PW, 0.8 µm"]
[null,null,null,null,null,null,null,null,null,"Cobalto (Co)","F. PVC 37 mm PW, 5 µm"]
[null,null,null,null,null,null,null,null,null,"Cobalto (Co)","F. Cap. PVC 37 mm PW, 5 µm"]
[null,null,null,null,null,null,null,null,null,"Cobalto (Co)","F. PVC 25 mm PW, 5 µm"]
[null,null,null,null,null,null,null,null,null,"Cobalto (Co)","Bulk Sample"]
[null,null,null,null,null,null,null,null,null,"Cromo (Cr)","F. MCE 37 mm, 0.8 µm"]
[null,null,null,null,null,null,null,null,null,"Cromo (Cr)","F. MCE 25 mm, 0.8 µm"]
[null,null,null,null,null,null,null,null,null,"Cromo (Cr)","F. MCE 37 mm PW, 0.8 µm"]
[null,null,null,null,null,null,null,null,null,"Cromo (Cr)","F. Cap. MCE 37 mm PW, 0.8 µm"]
[null,null,null,null,null,null,null,null,null,"Cromo (Cr)","F. MCE 37 mm PW, 0.8 µm"]
[null,null,null,null,null,null,null,null,null,"Cromo (Cr)","F. PVC 37 mm PW, 5 µm"]
[null,null,null,null,null,null,null,null,null,"Cromo (Cr)","F. Cap. PVC 37 mm PW, 5 µm"]
[null,null,null,null,null,null,null,null,null,"Cromo (Cr)","F. PVC 25 mm PW, 5 µm"]
[null,null,null,null,null,null,null,null,null,"Cromo (Cr)","Bulk Sample"]
[null,null,null,null,null,null,null,null,null,"Hierro (Fe)","F. MCE 37 mm, 0.8 µm"]
[null,null,null,null,null,null,null,null,null,"Hierro (Fe)","F. MCE 25 mm, 0.8 µm"]
[null,null,null,null,null,null,null,null,null,"Hierro (Fe)","F. MCE 37 mm PW, 0.8 µm"]
[null,null,null,null,null,null,null,null,null,"Hierro (Fe)","F. Cap. MCE 37 mm PW, 0.8 µm"]
[null,null,null,null,null,null,null,null,null,"Hierro (Fe)","F. MCE 37 mm PW, 0.8 µm"]
[null,null,null,null,null,null,null,null,null,"Hierro (Fe)","F. PVC 37 mm PW, 5 µm"]
[null,null,null,null,null,null,null,null,null,"Hierro (Fe)","F. Cap. PVC 37 mm PW, 5 µm"]
[null,null,null,null,null,null,null,null,null,"Hierro (Fe)","F. PVC 25 mm PW, 5 µm"]
[null,null,null,null,null,null,null,null,null,"Hierro (Fe)","Bulk Sample"]
[null,null,null,null,null,null,null,null,null,"Fosforo (P)","F. MCE 37 mm, 0.8 µm"]
[null,null,null,null,null,null,null,null,null,"Fosforo (P)","F. MCE 25 mm, 0.8 µm"]
[null,null,null,null,null,null,null,null,null,"Fosforo (P)","F. MCE 37 mm PW, 0.8 µm"]
[null,null,null,null,null,null,null,null,null,"Fosforo (P)","F. Cap. MCE 37 mm PW, 0.8 µm"]
[null,null,null,null,null,null,null,null,null,"Fosforo (P)","F. MCE 37 mm PW, 0.8 µm"]
[null,null,null,null,null,null,null,null,null,"Fosforo (P)","F. PVC 37 mm PW, 5 µm"]
[null,null,null,null,null,null,null,null,null,"Fosforo (P)","F. Cap. PVC 37 mm PW, 5 µm"]
[null,null,null,null,null,null,null,null,null,"Fosforo (P)","F. PVC 25 mm PW, 5 µm"]
[null,null,null,null,null,null,null,null,null,"Fosforo (P)","Bulk Sample"]
[null,null,null,null,null,null,null,null,null,"Potasio (K)","F. MCE 37 mm, 0.8 µm"]
[null,null,null,null,null,null,null,null,null,"Potasio (K)","F. MCE 25 mm, 0.8 µm"]
[null,null,null,null,null,null,null,null,null,"Potasio (K)","F. MCE 37 mm PW, 0.8 µm"]
[null,null,null,null,null,null,null,null,null,"Potasio (K)","F. Cap. MCE 37 mm PW, 0.8 µm"]
[null,null,null,null,null,null,null,null,null,"Potasio (K)","F. MCE 37 mm PW, 0.8 µm"]
[null,null,null,null,null,null,null,null,null,"Potasio (K)","F. PVC 37 mm PW, 5 µm"]
[null,null,null,null,null,null,null,null,null,"Potasio (K)","F. Cap. PVC 37 mm PW, 5 µm"]
[null,null,null,null,null,null,null,null,null,"Potasio (K)","F. PVC 25 mm PW, 5 µm"]
[null,null,null,null,null,null,null,null,null,"Potasio (K)","Bulk Sample"]
[null,null,null,null,null,null,null,null,null,"Litio (Li)","F. MCE 37 mm, 0.8 µm"]
[null,null,null,null,null,null,null,null,null,"Litio (Li)","F. MCE 25 mm, 0.8 µm"]
[null,null,null,null,null,null,null,null,null,"Litio (Li)","F. MCE 37 mm PW, 0.8 µm"]
[null,null,null,null,null,null,null,null,null,"Litio (Li)","F. Cap. MCE 37 mm PW, 0.8 µm"]
[null,null,null,null,null,null,null,null,null,"Litio (Li)","F. MCE 37 mm PW, 0.8 µm"]
[null,null,null,null,null,null,null,null,null,"Litio (Li)","F. PVC 37 mm PW, 5 µm"]
[null,null,null,null,null,null,null,null,null,"Litio (Li)","F. Cap. PVC 37 mm PW, 5 µm"]
[null,null,null,null,null,null,null,null,null,"Litio (Li)","F. PVC 25 mm PW, 5 µm"]
[null,null,null,null,null,null,null,null,null,"Litio (Li)","Bulk Sample"]
[null,null,null,null,null,null,null,null,null,"Magnesio (Mg)","F. MCE 37 mm, 0.8 µm"]
[null,null,null,null,null,null,null,null,null,"Magnesio (Mg)","F. MCE 25 mm, 0.8 µm"]
[null,null,null,null,null,null,null,null,null,"Magnesio (Mg)","F. MCE 37 mm PW, 0.8 µm"]
[null,null,null,null,null,null,null,null,null,"Magnesio (Mg)","F. Cap. MCE 37 mm PW, 0.8 µm"]
[null,null,null,null,null,null,null,null,null,"Magnesio (Mg)","F. MCE 37 mm PW, 0.8 µm"]
[null,null,null,null,null,null,null,null,null,"Magnesio (Mg)","F. PVC 37 mm PW, 5 µm"]
[null,null,null,null,null,null,null,null,null,"Magnesio (Mg)","F. Cap. PVC 37 mm PW, 5 µm"]
[null,null,null,null,null,null,null,null,null,"Magnesio (Mg)","F. PVC 25 mm PW, 5 µm"]
[null,null,null,null,null,null,null,null,null,"Magnesio (Mg)","Bulk Sample"]
[null,null,null,null,null,null,null,null,null,"Manganeso (Mn)","F. MCE 37 mm, 0.8 µm"]
[null,null,null,null,null,null,null,null,null,"Manganeso (Mn)","F. MCE 25 mm, 0.8 µm"]
[null,null,null,null,null,null,null,null,null,"Manganeso (Mn)","F. MCE 37 mm PW, 0.8 µm"]
[null,null,null,null,null,null,null,null,null,"Manganeso (Mn)","F. Cap. MCE 37 mm PW, 0.8 µm"]
[null,null,null,null,null,null,null,null,null,"Manganeso (Mn)","F. MCE 37 mm PW, 0.8 µm"]
[null,null,null,null,null,null,null,null,null,"Manganeso (Mn)","F. PVC 37 mm PW, 5 µm"]
[null,null,null,null,null,null,null,null,null,"Manganeso (Mn)","F. Cap. PVC 37 mm PW, 5 µm"]
[null,null,null,null,null,null,null,null,null,"Manganeso (Mn)","F. PVC 25 mm PW, 5 µm"]
[null,null,null,null,null,null,null,null,null,"Manganeso (Mn)","Bulk Sample"]
[null,null,null,null,null,null,null,null,null,"Molibdeno (Mo)","F. MCE 37 mm, 0.8 µm"]
[null,null,null,null,null,null,null,null,null,"Molibdeno (Mo)","F. MCE 25 mm, 0.8 µm"]
[null,null,null,null,null,null,null,null,null,"Molibdeno (Mo)","F. MCE 37 mm PW, 0.8 µm"]
[null,null,null,null,null,null,null,null,null,"Molibdeno (Mo)","F. Cap. MCE 37 mm PW, 0.8 µm"]
[null,null,null,null,null,null,null,null,null,"Molibdeno (Mo)","F. MCE 37 mm PW, 0.8 µm"]
[null,null,null,null,null,null,null,null,null,"Molibdeno (Mo)","F. PVC 37 mm PW, 5 µm"]
[null,null,null,null,null,null,null,null,null,"Molibdeno (Mo)","F. Cap. PVC 37 mm PW, 5 µm"]
[null,null,null,null,null,null,null,null,null,"Molibdeno (Mo)","F. PVC 25 mm PW, 5 µm"]
[null,null,null,null,null,null,null,null,null,"Molibdeno (Mo)","Bulk Sample"]
[null,null,null,null,null,null,null,null,null,"Níquel (Ni)","F. MCE 37 mm, 0.8 µm"]
[null,null,null,null,null,null,null,null,null,"Níquel (Ni)","F. MCE 25 mm, 0.8 µm"]
[null,null,null,null,null,null,null,null,null,"Níquel (Ni)","F. MCE 37 mm PW, 0.8 µm"]
[null,null,null,null,null,null,null,null,null,"Níquel (Ni)","F. Cap. MCE 37 mm PW, 0.8 µm"]
[null,null,null,null,null,null,null,null,null,"Níquel (Ni)","F. MCE 37 mm PW, 0.8 µm"]
[null,null,null,null,null,null,null,null,null,"Níquel (Ni)","F. PVC 37 mm PW, 5 µm"]
[null,null,null,null,null,null,null,null,null,"Níquel (Ni)","F. Cap. PVC 37 mm PW, 5 µm"]
[null,null,null,null,null,null,null,null,null,"Níquel (Ni)","F. PVC 25 mm PW, 5 µm"]
[null,null,null,null,null,null,null,null,null,"Níquel (Ni)","Bulk Sample"]
[null,null,null,null,null,null,null,null,null,"Plomo (Pb)","F. MCE 37 mm, 0.8 µm"]
[null,null,null,null,null,null,null,null,null,"Plomo (Pb)","F. MCE 25 mm, 0.8 µm"]
[null,null,null,null,null,null,null,null,null,"Plomo (Pb)","F. MCE 37 mm PW, 0.8 µm"]
[null,null,null,null,null,null,null,null,null,"Plomo (Pb)","F. Cap. MCE 37 mm PW, 0.8 µm"]
[null,null,null,null,null,null,null,null,null,"Plomo (Pb)","F. MCE 37 mm PW, 0.8 µm"]
[null,null,null,null,null,null,null,null,null,"Plomo (Pb)","F. PVC 37 mm PW, 5 µm"]
[null,null,null,null,null,null,null,null,null,"Plomo (Pb)","F. Cap. PVC 37 mm PW, 5 µm"]
[null,null,null,null,null,null,null,null,null,"Plomo (Pb)","F. PVC 25 mm PW, 5 µm"]
[null,null,null,null,null,null,null,null,null,"Plomo (Pb)","Bulk Sample"]
[null,null,null,null,null,null,null,null,null,"Selenio (Se)","F. MCE 37 mm, 0.8 µm"]
[null,null,null,null,null,null,null,null,null,"Selenio (Se)","F. MCE 25 mm, 0.8 µm"]
[null,null,null,null,null,null,null,null,null,"Selenio (Se)","F. MCE 37 mm PW, 0.8 µm"]
[null,null,null,null,null,null,null,null,null,"Selenio (Se)","F. Cap. MCE 37 mm PW, 0.8 µm"]
[null,null,null,null,null,null,null,null,null,"Selenio (Se)","F. MCE 37 mm PW, 0.8 µm"]
[null,null,null,null,null,null,null,null,null,"Selenio (Se)","F. PVC 37 mm PW, 5 µm"]
[null,null,null,null,null,null,null,null,null,"Selenio (Se)","F. Cap. PVC 37 mm PW, 5 µm"]
[null,null,null,null,null,null,null,null,null,"Selenio (Se)","F. PVC 25 mm PW, 5 µm"]
[null,null,null,null,null,null,null,null,null,"Selenio (Se)","Bulk Sample"]
[null,null,null,null,null,null,null,null,null,"Antimonio (Sb)","F. MCE 37 mm, 0.8 µm"]
[null,null,null,null,null,null,null,null,null,"Antimonio (Sb)","F. MCE 25 mm, 0.8 µm"]
[null,null,null,null,null,null,null,null,null,"Antimonio (Sb)","F. MCE 37 mm PW, 0.8 µm"]
[null,null,null,null,null,null,null,null,null,"Antimonio (Sb)","F. Cap. MCE 37 mm PW, 0.8 µm"]
[null,null,null,null,null,null,null,null,null,"Antimonio (Sb)","F. MCE 37 mm PW, 0.8 µm"]
[null,null,null,null,null,null,null,null,null,"Antimonio (Sb)","F. PVC 37 mm PW, 5 µm"]
[null,null,null,null,null,null,null,null,null,"Antimonio (Sb)","F. Cap. PVC 37 mm PW, 5 µm"]
[null,null,null,null,null,null,null,null,null,"Antimonio (Sb)","F. PVC 25 mm PW, 5 µm"]
[null,null,null,null,null,null,null,null,null,"Antimonio (Sb)","Bulk Sample"]
[null,null,null,null,null,null,null,null,null,"Estaño (Sn)","F. MCE 37 mm, 0.8 µm"]
[null,null,null,null,null,null,null,null,null,"Estaño (Sn)","F. MCE 25 mm, 0.8 µm"]
[null,null,null,null,null,null,null,null,null,"Estaño (Sn)","F. MCE 37 mm PW, 0.8 µm"]
[null,null,null,null,null,null,null,null,null,"Estaño (Sn)","F. Cap. MCE 37 mm PW, 0.8 µm"]
[null,null,null,null,null,null,null,null,null,"Estaño (Sn)","F. MCE 37 mm PW, 0.8 µm"]
[null,null,null,null,null,null,null,null,null,"Estaño (Sn)","F. PVC 37 mm PW, 5 µm"]
[null,null,null,null,null,null,null,null,null,"Estaño (Sn)","F. Cap. PVC 37 mm PW, 5 µm"]
[null,null,null,null,null,null,null,null,null,"Estaño (Sn)","F. PVC 25 mm PW, 5 µm"]
[null,null,null,null,null,null,null,null,null,"Estaño (Sn)","Bulk Sample"]
[null,null,null,null,null,null,null,null,null,"Titanio (Ti)","F. MCE 37 mm, 0.8 µm"]
[null,null,null,null,null,null,null,null,null,"Titanio (Ti)","F. MCE 25 mm, 0.8 µm"]
[null,null,null,null,null,null,null,null,null,"Titanio (Ti)","F. MCE 37 mm PW, 0.8 µm"]
[null,null,null,null,null,null,null,null,null,"Titanio (Ti)","F. Cap. MCE 37 mm PW, 0.8 µm"]
[null,null,null,null,null,null,null,null,null,"Titanio (Ti)","F. MCE 37 mm PW, 0.8 µm"]
[null,null,null,null,null,null,null,null,null,"Titanio (Ti)","F. PVC 37 mm PW, 5 µm"]
[null,null,null,null,null,null,null,null,null,"Titanio (Ti)","F. Cap. PVC 37 mm PW, 5 µm"]
[null,null,null,null,null,null,null,null,null,"Titanio (Ti)","F. PVC 25 mm PW, 5 µm"]
[null,null,null,null,null,null,null,null,null,"Titanio (Ti)","Bulk Sample"]
[null,null,null,null,null,null,null,null,null,"Talio (Tl)","F. MCE 37 mm, 0.8 µm"]
[null,null,null,null,null,null,null,null,null,"Talio (Tl)","F. MCE 25 mm, 0.8 µm"]
[null,null,null,null,null,null,null,null,null,"Talio (Tl)","F. MCE 37 mm PW, 0.8 µm"]
[null,null,null,null,null,null,null,null,null,"Talio (Tl)","F. Cap. MCE 37 mm PW, 0.8 µm"]
[null,null,null,null,null,null,null,null,null,"Talio (Tl)","F. MCE 37 mm PW, 0.8 µm"]
[null,null,null,null,null,null,null,null,null,"Talio (Tl)","F. PVC 37 mm PW, 5 µm"]
[null,null,null,null,null,null,null,null,null,"Talio (Tl)","F. Cap. PVC 37 mm PW, 5 µm"]
[null,null,null,null,null,null,null,null,null,"Talio (Tl)","F. PVC 25 mm PW, 5 µm"]
[null,null,null,null,null,null,null,null,null,"Talio (Tl)","Bulk Sample"]
[null,null,null,null,null,null,null,null,null,"Vanadio (V)","F. MCE 37 mm, 0.8 µm"]
[null,null,null,null,null,null,null,null,null,"Vanadio (V)","F. MCE 25 mm, 0.8 µm"]
[null,null,null,null,null,null,null,null,null,"Vanadio (V)","F. MCE 37 mm PW, 0.8 µm"]
[null,null,null,null,null,null,null,null,null,"Vanadio (V)","F. Cap. MCE 37 mm PW, 0.8 µm"]
[null,null,null,null,null,null,null,null,null,"Vanadio (V)","F. MCE 37 mm PW, 0.8 µm"]
[null,null,null,null,null,null,null,null,null,"Vanadio (V)","F. PVC 37 mm PW, 5 µm"]
[null,null,null,null,null,null,null,null,null,"Vanadio (V)","F. Cap. PVC 37 mm PW, 5 µm"]
[null,null,null,null,null,null,null,null,null,"Vanadio (V)","F. PVC 25 mm PW, 5 µm"]
[null,null,null,null,null,null,null,null,null,"Vanadio (V)","Bulk Sample"]
[null,null,null,null,null,null,null,null,null,"Zinc (Zn)","F. MCE 37 mm, 0.8 µm"]
[null,null,null,null,null,null,null,null,null,"Zinc (Zn)","F. MCE 25 mm, 0.8 µm"]
[null,null,null,null,null,null,null,null,null,"Zinc (Zn)","F. MCE 37 mm PW, 0.8 µm"]
[null,null,null,null,null,null,null,null,null,"Zinc (Zn)","F. Cap. MCE 37 mm PW, 0.8 µm"]
[null,null,null,null,null,null,null,null,null,"Zinc (Zn)","F. MCE 37 mm PW, 0.8 µm"]
[null,null,null,null,null,null,null,null,null,"Zinc (Zn)","F. PVC 37 mm PW, 5 µm"]
[null,null,null,null,null,null,null,null,null,"Zinc (Zn)","F. Cap. PVC 37 mm PW, 5 µm"]
[null,null,null,null,null,null,null,null,null,"Zinc (Zn)","F. PVC 25 mm PW, 5 µm"]
[null,null,null,null,null,null,null,null,null,"Zinc (Zn)","Bulk Sample"]
[null,null,null,null,null,null,null,null,null,"Fibras de asbesto - Reglas A","F. MCE 25 mm, 0.8 µm"]
[null,null,null,null,null,null,null,null,null,"Fibras de asbesto - Reglas A","F. MCE 25 mm, 1.2 µm"]
[null,null,null,null,null,null,null,null,null,"Fibras de vidrio - Reglas B","F. MCE 25 mm, 0.8 µm"]
[null,null,null,null,null,null,null,null,null,"Fibras de vidrio - Reglas B","F. MCE 25 mm, 1.2 µm"]
[null,null,null,null,null,null,null,null,null,"Fibras cerámicas - Reglas B","F. MCE 25 mm, 0.8 µm"]
[null,null,null,null,null,null,null,null,null,"Fibras cerámicas - Reglas B","F. MCE 25 mm, 1.2 µm"]
[null,null,null,null,null,null,null,null,null,"Fibras naturales - Reglas B","F. MCE 25 mm, 0.8 µm"]
[null,null,null,null,null,null,null,null,null,"Fibras naturales - Reglas B","F. MCE 25 mm, 1.2 µm"]
[null,null,null,null,null,null,null,null,null,"Hidroxido de sodio  (1310-73-2)","F. PTFE 37 mm, 1 µm"]
[null,null,null,null,null,null,null,null,null,"Hidroxido de sodio  (1310-73-2)","F. PTFE 25 mm, 1 µm"]
[null,null,null,null,null,null,null,null,null,"Hidroxido de potasio (1310-58-3)","F. PTFE 37 mm, 1 µm"]
[null,null,null,null,null,null,null,null,null,"Hidroxido de potasio (1310-58-3)","F. PTFE 25 mm, 1 µm"]
[null,null,null,null,null,null,null,null,null,"Hidroxido de litio (1310-65-2)","F. PTFE 37 mm, 1 µm"]
[null,null,null,null,null,null,null,null,null,"Hidroxido de litio (1310-65-2)","F. PTFE 25 mm, 1 µm"]
[null,null,null,null,null,null,null,null,null,"Fibras de asbesto","F. MCE 25 mm, 0.45 µm"]
[null,null,null,null,null,null,null,null,null,"Silice cristalina","F. PVC 37 mm PW, 5 µm"]
[null,null,null,null,null,null,null,null,null,"Silice cristalina","F. Cap. PVC 37 mm PW, 5 µm"]
[null,null,null,null,null,null,null,null,null,"Silice cristalina","F. PVC 25 mm PW, 5 µm"]
[null,null,null,null,null,null,null,null,null,"Silice cristalina","Bulk Sample"]
[null,null,null,null,null,null,null,null,null,"Cuarzo  (14808-60-7)","F. PVC 37 mm PW, 5 µm"]
[null,null,null,null,null,null,null,null,null,"Cuarzo  (14808-60-7)","F. Cap. PVC 37 mm PW, 5 µm"]
[null,null,null,null,null,null,null,null,null,"Cuarzo  (14808-60-7)","F. PVC 25 mm PW, 5 µm"]
[null,null,null,null,null,null,null,null,null,"Cuarzo  (14808-60-7)","Bulk Sample"]
[null,null,null,null,null,null,null,null,null,"Cristobalita (14464-46-1)","F. PVC 37 mm PW, 5 µm"]
[null,null,null,null,null,null,null,null,null,"Cristobalita (14464-46-1)","F. Cap. PVC 37 mm PW, 5 µm"]
[null,null,null,null,null,null,null,null,null,"Cristobalita (14464-46-1)","F. PVC 25 mm PW, 5 µm"]
[null,null,null,null,null,null,null,null,null,"Cristobalita (14464-46-1)","Bulk Sample"]
[null,null,null,null,null,null,null,null,null,"Cromo VI soluble (18540-29-9 )","F. PVC 37 mm, 5 µm"]
[null,null,null,null,null,null,null,null,null,"Cromo VI soluble (18540-29-9 )","F. PVC 25 mm, 5 µm"]
[null,null,null,null,null,null,null,null,null,"Cromo VI insoluble (18540-29-9 )","F. PVC 37 mm, 5 µm"]
[null,null,null,null,null,null,null,null,null,"Cromo VI insoluble (18540-29-9 )","F. PVC 25 mm, 5 µm"]
[null,null,null,null,null,null,null,null,null,"Ácido crómico (7738-94-5​)","F. PVC 37 mm, 5 µm"]
[null,null,null,null,null,null,null,null,null,"Ácido crómico (7738-94-5​)","F. PVC 25 mm, 5 µm"]
[null,null,null,null,null,null,null,null,null,"Particulas de floruro","F. NC 37 mm tratado, 0.8 µm"]
[null,null,null,null,null,null,null,null,null,"Ácido fluorhídrico (7664-39-3)","F. NC 37 mm tratado, 0.8 µm"]
[null,null,null,null,null,null,null,null,null,"Ácido clorhídrico (7647-01-0)","T. SKC 226-10-03"]
[null,null,null,null,null,null,null,null,null,"Ácido clorhídrico (7647-01-0)","T. ORBO 53"]
[null,null,null,null,null,null,null,null,null,"Ácido clorhídrico (7647-01-0)","F. Cuarzo 37 mm tratado"]
[null,null,null,null,null,null,null,null,null,"Ácido bromhídrico (10035-10-6)","T. SKC 226-10-03"]
[null,null,null,null,null,null,null,null,null,"Ácido bromhídrico (10035-10-6)","T. ORBO 53"]
[null,null,null,null,null,null,null,null,null,"Ácido bromhídrico (10035-10-6)","F. Cuarzo 37 mm tratado"]
[null,null,null,null,null,null,null,null,null,"Ácido nítrico (7697-37-2)","T. SKC 226-10-03"]
[null,null,null,null,null,null,null,null,null,"Ácido nítrico (7697-37-2)","T. ORBO 53"]
[null,null,null,null,null,null,null,null,null,"Ácido nítrico (7697-37-2)","F. Cuarzo 37 mm tratado"]
[null,null,null,null,null,null,null,null,null,"Ácido sulfúrico (7664-93-9)","T. SKC 226-10-03"]
[null,null,null,null,null,null,null,null,null,"Ácido sulfúrico (7664-93-9)","T. ORBO 53"]
[null,null,null,null,null,null,null,null,null,"Ácido sulfúrico (7664-93-9)","F. MCE 37 mm, 0.8 µm"]
[null,null,null,null,null,null,null,null,null,"Ácido sulfúrico (7664-93-9)","F. MCE 25 mm, 0.8 µm"]
[null,null,null,null,null,null,null,null,null,"Ácido sulfúrico (7664-93-9)","F. PTFE 37 mm, 0.45 µm"]
[null,null,null,null,null,null,null,null,null,"Ácido sulfúrico (7664-93-9)","F. Cuarzo 37 mm"]
[null,null,null,null,null,null,null,null,null,"Ácido fosfórico (7664-38-2)","T. SKC 226-10-03"]
[null,null,null,null,null,null,null,null,null,"Ácido fosfórico (7664-38-2)","T. ORBO 53"]
[null,null,null,null,null,null,null,null,null,"Ácido fosfórico (7664-38-2)","F. PTFE 37 mm, 0.45 µm"]
[null,null,null,null,null,null,null,null,null,"Ácido fosfórico (7664-38-2)","F. Cuarzo 37 mm"]
[null,null,null,null,null,null,null,null,null,"Peróxido de hidrógeno (7722-84-1)","F. Cuarzo 37 mm tratado"]
[null,null,null,null,null,null,null,null,null,"Dióxido de cloro (10049-04-4)","0.02% KI"]
[null,null,null,null,null,null,null,null,null,"Ozono (10028-15-6)","F. GFF 37 mm tratado"]
[null,null,null,null,null,null,null,null,null,"Ozono (10028-15-6)","F. GFF 25 mm tratado"]
[null,null,null,null,null,null,null,null,null,"Ozono (10028-15-6)","PM 586AT"]
[null,null,null,null,null,null,null,null,null,"Asbesto","Bulk Sample"]
[null,null,null,null,null,null,null,null,null,"OTRO","Otro"]
[null,null,null,null,null,null,null,null,null,"Metil acetato (79-20-9)","T. SKC 226-01"]
[null,null,null,null,null,null,null,null,null,"Metil acetato (79-20-9)","T. SKC 226-09"]
[null,null,null,null,null,null,null,null,null,"Metil acetato (79-20-9)","T. ZST-002"]
[null,null,null,null,null,null,null,null,null,"Metil acetato (79-20-9)","T. ORBO 32S"]
[null,null,null,null,null,null,null,null,null,"Metil acetato (79-20-9)","T. ORBO 32L"]
[null,null,null,null,null,null,null,null,null,"Metil acetato (79-20-9)","PM SKC 575-001"]
[null,null,null,null,null,null,null,null,null,"Metil acetato (79-20-9)","PM SKC 575-002"]
[null,null,null,null,null,null,null,null,null,"Metil acetato (79-20-9)","PM 546AT"]
[null,null,null,null,null,null,null,null,null,"Metil acetato (79-20-9)","PM 566AT"]
[null,null,null,null,null,null,null,null,null,"Metil acetato (79-20-9)","Otro"]
[null,null,null,null,null,null,null,null,null,"Vinil acetato (108-05-4)","T. SKC 226-01"]
[null,null,null,null,null,null,null,null,null,"Vinil acetato (108-05-4)","T. SKC 226-09"]
[null,null,null,null,null,null,null,null,null,"Vinil acetato (108-05-4)","T. ZST-001"]
[null,null,null,null,null,null,null,null,null,"Vinil acetato (108-05-4)","T. ZST-002"]
[null,null,null,null,null,null,null,null,null,"Vinil acetato (108-05-4)","T. ORBO 32S"]
[null,null,null,null,null,null,null,null,null,"Vinil acetato (108-05-4)","T. ORBO 32L"]
[null,null,null,null,null,null,null,null,null,"Vinil acetato (108-05-4)","PM SKC 575-002"]
[null,null,null,null,null,null,null,null,null,"Vinil acetato (108-05-4)","PM 525AT"]
[null,null,null,null,null,null,null,null,null,"Vinil acetato (108-05-4)","PM 546AT"]
[null,null,null,null,null,null,null,null,null,"Vinil acetato (108-05-4)","PM 566AT"]
[null,null,null,null,null,null,null,null,null,"Vinil acetato (108-05-4)","Otro"]
[null,null,null,null,null,null,null,null,null,"Isopropil acetato (108-21-4)","T. SKC 226-01"]
[null,null,null,null,null,null,null,null,null,"Isopropil acetato (108-21-4)","T. SKC 226-09"]
[null,null,null,null,null,null,null,null,null,"Isopropil acetato (108-21-4)","T. ZST-001"]
[null,null,null,null,null,null,null,null,null,"Isopropil acetato (108-21-4)","T. ZST-002"]
[null,null,null,null,null,null,null,null,null,"Isopropil acetato (108-21-4)","T. ORBO 32S"]
[null,null,null,null,null,null,null,null,null,"Isopropil acetato (108-21-4)","T. ORBO 32L"]
[null,null,null,null,null,null,null,null,null,"Isopropil acetato (108-21-4)","PM SKC 575-001"]
[null,null,null,null,null,null,null,null,null,"Isopropil acetato (108-21-4)","PM SKC 575-002"]
[null,null,null,null,null,null,null,null,null,"Isopropil acetato (108-21-4)","PM 525AT"]
[null,null,null,null,null,null,null,null,null,"Isopropil acetato (108-21-4)","PM 546AT"]
[null,null,null,null,null,null,null,null,null,"Isopropil acetato (108-21-4)","PM 566AT"]
[null,null,null,null,null,null,null,null,null,"Isopropil acetato (108-21-4)","Otro"]
[null,null,null,null,null,null,null,null,null,"HCT's como n-hexano","SKC 226-01"]
[null,null,null,null,null,null,null,null,null,"HCT's como n-hexano","SKC 226-09"]
[null,null,null,null,null,null,null,null,null,"HCT's como n-hexano","T. ZST-001"]
[null,null,null,null,null,null,null,null,null,"HCT's como n-hexano","T. ZST-002"]
[null,null,null,null,null,null,null,null,null,"HCT's como n-hexano","T. ORBO 32S"]
[null,null,null,null,null,null,null,null,null,"HCT's como n-hexano","T. ORBO 32L"]
[null,null,null,null,null,null,null,null,null,"HCT's como n-hexano","PM SKC 575-001"]
[null,null,null,null,null,null,null,null,null,"HCT's como n-hexano","PM SKC 575-002"]
[null,null,null,null,null,null,null,null,null,"HCT's como n-hexano","PM 525AT"]
[null,null,null,null,null,null,null,null,null,"HCT's como n-hexano","PM 546AT"]
[null,null,null,null,null,null,null,null,null,"HCT's como n-hexano","PM 566AT"]
[null,null,null,null,null,null,null,null,null,"HCT's como n-hexano","Otro"]
[null,null,null,null,null,null,null,null,null,"HCT's como n-hexano","Bulk Sample"]
[null,null,null,null,null,null,null,null,null,"Oxido de etileno (75-21-8)","PM 555AT"]
[null,null,null,null,null,null,null,null,null,"Oxido de etileno (75-21-8)","PM SKC 525-005"]